{"text_format":"1","workbook":"xlsx","n_sheets":3,"sheets":["Profile","DATA","TeenPreg"],"not_rendered":{"charts":21,"images":2,"macros":1,"external_links":0,"defined_names":9,"comments":0,"pivot_tables":0},"unopened":[],"bounds":{"document_bytes":16777216,"sheet_cells":100000,"rows_first":2000,"rows_last":500,"rows_between":2000,"halvings":0,"cell_chars":16384,"cell_head_chars":4096},"cells_cut":0,"cells_raw":0,"read":"whole","date_system":"1900"}

{"sheet":"Profile","index":0,"n_rows":608,"n_cols":15,"rows_kept":608,"cut":false,"hidden":false,"merged":[[217,11,217,12],[219,11,219,12],[217,13,217,14],[219,13,219,14],[218,5,218,6],[218,7,218,8],[218,9,218,10],[218,11,218,12],[218,13,218,14],[217,0,217,4],[218,0,218,4],[219,0,219,4],[239,9,239,10],[239,7,239,8],[239,5,239,6],[240,5,240,6],[240,7,240,8],[240,9,240,10],[240,11,240,12],[240,13,240,14],[239,0,239,4],[240,0,240,4],[211,1,211,4],[212,1,212,4],[216,13,216,14],[216,11,216,12],[216,9,216,10],[220,9,220,10],[220,11,220,12],[220,13,220,14],[215,2,215,14],[217,5,217,6],[219,5,219,6],[217,7,217,8],[219,7,219,8],[217,9,217,10],[219,9,219,10],[53,2,53,4],[58,2,58,4],[50,6,50,9],[51,11,51,14],[54,11,54,14],[59,2,59,4],[58,10,58,14],[55,1,55,4],[59,11,59,14],[60,11,60,14],[45,0,46,14],[400,0,402,14],[230,11,230,12],[230,13,230,14],[231,9,231,10],[230,9,230,10],[231,11,231,12],[231,13,231,14],[232,0,232,14],[233,0,233,14],[234,1,236,14],[234,0,236,0],[237,0,237,14],[238,13,238,14],[238,11,238,12],[601,0,601,6],[602,0,602,6],[601,7,601,8],[601,9,601,10],[601,11,601,12],[601,13,601,14],[602,7,602,8],[602,9,602,10],[602,11,602,12],[602,13,602,14],[504,7,504,10],[505,7,505,10],[292,0,292,9],[293,0,293,9],[294,0,294,9],[290,10,290,14],[290,0,291,9],[295,0,295,9],[296,0,296,9],[598,0,598,6],[598,7,598,8],[598,9,598,10],[598,11,598,12],[598,13,598,14],[599,0,599,6],[599,7,599,8],[599,9,599,10],[599,11,599,12],[599,13,599,14],[600,0,600,6],[600,7,600,8],[600,9,600,10],[600,13,600,14],[594,0,594,6],[594,7,594,8],[594,9,594,10],[594,11,594,12],[594,13,594,14],[596,0,596,6],[596,7,596,8],[596,9,596,10],[596,11,596,12],[596,13,596,14],[592,0,592,6],[592,7,592,8],[592,9,592,10],[592,11,592,12],[592,13,592,14],[593,0,593,6],[593,7,593,8],[593,9,593,10],[593,11,593,12],[593,13,593,14],[595,0,595,6],[595,7,595,8],[595,9,595,10],[595,11,595,12],[595,13,595,14],[597,0,597,6],[597,7,597,8],[597,9,597,10],[597,11,597,12],[597,13,597,14],[579,7,579,8],[579,0,579,6],[580,0,580,6],[581,0,581,6],[582,0,582,6],[580,7,580,8],[581,7,581,8],[582,7,582,8],[581,9,581,10],[582,9,582,10],[582,11,582,12],[572,0,572,1],[591,0,591,6],[591,7,591,8],[591,9,591,10],[591,11,591,12],[600,11,600,12],[591,13,591,14],[590,0,590,14],[575,13,575,14],[576,13,576,14],[577,13,577,14],[578,13,578,14],[579,13,579,14],[580,13,580,14],[581,13,581,14],[582,13,582,14],[577,11,577,12],[578,11,578,12],[579,11,579,12],[580,11,580,12],[575,11,575,12],[576,11,576,12],[581,11,581,12],[575,0,575,6],[576,0,576,6],[575,9,575,10],[575,7,575,8],[576,9,576,10],[577,9,577,10],[578,9,578,10],[579,9,579,10],[580,9,580,10],[576,7,576,8],[577,0,577,6],[589,0,589,13],[578,0,578,6],[577,7,577,8],[578,7,578,8],[379,12,379,14],[380,12,380,14],[404,2,404,14],[349,9,349,10],[349,11,349,12],[349,13,349,14],[350,0,350,4],[351,0,351,6],[351,7,351,8],[351,9,351,10],[351,11,351,12],[351,13,351,14],[372,13,372,14],[373,0,373,6],[373,7,373,8],[373,9,373,10],[373,11,373,12],[373,13,373,14],[353,9,353,10],[365,11,365,12],[558,0,559,14],[175,0,176,2],[367,7,367,8],[367,9,367,10],[367,11,367,12],[368,7,368,8],[331,13,331,14],[213,7,213,8],[345,11,345,12],[345,13,345,14],[334,13,334,14],[130,0,130,14],[55,5,55,9],[56,6,56,9],[394,0,399,1],[347,13,347,14],[348,0,348,6],[348,7,348,8],[348,9,348,10],[348,11,348,12],[375,0,375,4],[376,0,376,6],[376,7,376,8],[376,9,376,10],[376,11,376,12],[376,13,376,14],[405,0,405,1],[57,6,57,9],[201,0,201,4],[167,0,167,2],[164,5,164,6],[165,3,165,4],[59,6,59,9],[61,2,61,4],[273,3,273,9],[274,3,274,9],[275,3,275,9],[228,0,228,12],[228,13,228,14],[366,11,366,12],[139,0,139,1],[139,2,139,8],[139,9,139,10],[139,11,139,12],[139,13,139,14],[230,0,230,1],[231,2,231,8],[301,0,301,1],[269,3,269,9],[361,9,361,10],[341,13,341,14],[342,13,342,14],[364,11,364,12],[346,0,346,6],[346,7,346,8],[346,9,346,10],[346,11,346,12],[348,13,348,14],[47,5,47,9],[47,1,47,4],[48,2,48,4],[207,2,208,8],[210,7,210,8],[211,7,211,8],[206,0,206,14],[209,0,209,4],[48,11,48,14],[49,11,49,14],[50,11,50,14],[60,2,60,4],[48,6,48,9],[62,2,62,4],[58,6,58,9],[60,6,60,9],[203,5,203,6],[166,3,166,4],[204,5,204,6],[197,0,197,12],[54,2,54,4],[52,2,52,4],[214,0,214,13],[71,9,71,10],[72,13,72,14],[72,11,72,12],[49,6,49,9],[216,5,216,6],[226,0,226,4],[227,7,227,8],[226,7,226,8],[205,0,205,3],[220,5,220,6],[166,5,166,6],[167,3,167,4],[50,2,50,4],[51,2,51,4],[51,6,51,9],[225,0,225,4],[225,5,225,6],[220,0,220,4],[52,5,54,10],[509,3,509,6],[99,3,99,4],[508,0,508,6],[508,7,508,10],[459,2,459,14],[460,2,460,14],[461,5,461,14],[472,11,472,14],[464,2,464,4],[465,2,465,4],[464,5,464,14],[476,7,476,10],[461,2,461,4],[462,2,462,4],[473,7,473,10],[471,3,471,6],[509,7,509,10],[480,11,480,14],[364,7,364,8],[333,13,333,14],[275,11,275,12],[172,2,172,14],[339,13,339,14],[356,13,356,14],[336,13,336,14],[201,7,201,8],[337,7,337,8],[147,13,147,14],[230,2,230,8],[365,9,365,10],[72,3,72,4],[371,0,371,6],[371,7,371,8],[371,9,371,10],[360,9,360,10],[360,11,360,12],[359,7,359,8],[337,9,337,10],[337,11,337,12],[355,13,355,14],[341,11,341,12],[92,3,92,4],[91,5,91,6],[104,0,104,8],[264,2,264,14],[272,11,272,12],[75,9,75,14],[75,3,75,8],[114,3,114,4],[73,0,73,2],[254,13,255,14],[264,0,264,1],[267,2,267,14],[339,9,339,10],[336,0,336,6],[336,7,336,8],[336,9,336,10],[336,11,336,12],[335,0,335,6],[213,0,213,4],[238,9,238,10],[269,11,269,12],[333,11,333,12],[330,13,330,14],[330,11,330,12],[303,2,303,14],[335,7,335,8],[285,0,285,14],[299,0,299,1],[167,5,167,6],[166,0,166,2],[203,0,203,3],[272,13,272,14],[573,0,573,1],[410,2,410,14],[371,11,371,12],[571,0,571,1],[410,0,410,1],[406,0,409,1],[412,0,412,1],[407,2,407,11],[405,2,405,14],[572,2,572,14],[370,7,370,8],[370,9,370,10],[370,11,370,12],[370,13,370,14],[389,3,389,14],[414,0,418,1],[414,2,414,14],[390,9,390,14],[388,3,388,7],[382,2,382,11],[52,11,52,14],[53,11,53,14],[56,2,56,4],[55,11,55,14],[80,9,80,10],[74,0,74,2],[30,0,30,14],[38,0,38,14],[44,0,44,14],[49,2,49,4],[29,0,29,14],[47,10,47,14],[56,11,56,14],[57,11,57,14],[37,0,37,14],[515,7,515,10],[570,0,570,14],[173,2,173,14],[174,0,174,1],[163,0,163,2],[403,0,403,14],[341,9,341,10],[359,9,359,10],[366,13,366,14],[367,13,367,14],[368,9,368,10],[368,11,368,12],[368,13,368,14],[404,0,404,1],[171,2,171,14],[171,0,171,1],[174,2,174,14],[114,9,115,14],[116,9,116,10],[82,0,83,2],[80,0,80,4],[72,9,72,10],[93,3,93,4],[32,0,32,14],[33,0,33,14],[35,0,35,14],[36,0,36,14],[39,0,39,14],[96,3,96,4],[79,0,79,4],[78,13,78,14],[88,3,88,4],[5,1,5,4],[65,0,65,14],[5,11,5,14],[6,11,6,14],[41,0,41,14],[88,0,88,2],[71,13,71,14],[83,7,92,14],[80,7,80,8],[5,5,5,10],[6,5,6,10],[16,0,16,14],[6,1,6,4],[7,0,15,14],[17,0,17,14],[23,0,23,14],[74,3,74,8],[212,5,212,6],[118,11,118,12],[140,0,140,14],[96,9,104,14],[103,5,103,6],[99,0,99,2],[97,0,97,2],[100,0,100,2],[96,7,96,8],[132,0,133,1],[229,0,229,14],[337,0,337,6],[359,11,359,12],[353,7,353,8],[24,0,24,14],[25,0,25,14],[63,0,63,13],[57,2,57,4],[70,0,72,2],[74,9,74,14],[78,11,78,12],[118,0,118,2],[115,6,115,7],[78,9,78,10],[138,0,138,1],[138,2,138,8],[89,0,89,2],[92,0,92,2],[116,11,116,12],[145,11,145,12],[119,0,119,14],[136,9,136,10],[98,3,98,4],[98,5,98,6],[100,5,100,6],[102,5,102,6],[146,2,146,8],[116,13,116,14],[117,11,117,12],[142,13,142,14],[131,0,131,14],[132,2,132,14],[142,0,142,8],[149,2,149,4],[371,13,371,14],[100,7,100,8],[135,2,135,8],[145,0,145,1],[210,0,210,4],[271,11,271,12],[270,11,270,12],[137,11,137,12],[142,9,142,10],[137,9,137,10],[204,7,204,8],[116,6,116,8],[141,2,141,14],[248,5,248,6],[138,9,138,10],[144,9,144,10],[103,0,103,2],[103,3,103,4],[101,0,101,2],[101,3,101,4],[102,3,102,4],[116,0,116,2],[145,2,145,8],[145,9,145,10],[144,11,144,12],[224,0,224,4],[205,7,205,8],[117,13,117,14],[165,0,165,2],[149,9,149,12],[227,0,227,4],[115,3,115,4],[195,13,195,14],[202,7,202,8],[227,5,227,6],[108,0,108,5],[107,0,107,5],[147,2,147,8],[147,9,147,10],[147,11,147,12],[106,7,106,8],[107,7,107,8],[158,0,158,14],[117,3,117,5],[138,11,138,12],[138,13,138,14],[95,0,95,14],[99,5,99,6],[137,0,137,1],[99,7,99,8],[117,9,117,10],[137,13,137,14],[134,0,134,8],[209,5,209,6],[222,0,223,1],[135,13,135,14],[96,5,96,6],[135,11,135,12],[164,3,164,4],[120,9,120,14],[134,11,134,12],[225,7,225,8],[113,0,114,2],[125,0,128,3],[133,2,133,14],[224,7,224,8],[222,2,222,8],[198,0,198,14],[200,5,200,6],[117,0,117,2],[146,9,146,10],[164,0,164,2],[212,7,212,8],[207,0,208,1],[209,7,209,8],[211,5,211,6],[204,0,204,3],[249,0,249,4],[249,5,249,6],[249,7,249,8],[276,0,276,14],[268,11,268,12],[118,9,118,10],[98,0,98,2],[129,0,129,12],[129,13,129,14],[165,5,165,6],[163,3,163,4],[101,5,101,6],[102,7,102,8],[97,3,97,4],[90,0,90,2],[78,5,78,6],[90,5,90,6],[200,0,200,4],[120,0,120,4],[136,11,136,12],[136,2,136,8],[143,9,143,10],[148,0,148,14],[100,3,100,4],[103,7,103,8],[142,11,142,12],[143,11,143,12],[101,7,101,8],[143,0,143,1],[147,0,147,1],[144,2,144,8],[143,13,143,14],[71,7,71,8],[73,3,73,8],[72,7,72,8],[72,5,72,6],[71,5,71,6],[71,3,71,4],[75,0,75,2],[76,0,76,2],[79,11,79,12],[98,7,98,8],[76,3,76,8],[67,0,67,14],[68,0,68,14],[73,9,73,14],[79,13,79,14],[80,11,80,12],[66,0,66,14],[89,5,89,6],[97,7,97,8],[69,0,69,14],[88,5,88,6],[78,7,78,8],[81,0,81,14],[79,7,79,8],[82,3,83,4],[82,7,82,14],[82,5,83,6],[71,11,71,12],[80,5,80,6],[89,3,89,4],[90,3,90,4],[87,0,87,2],[0,0,0,14],[331,0,331,6],[331,7,331,8],[330,7,330,8],[330,9,330,10],[328,9,328,10],[328,13,328,14],[242,0,244,2],[213,5,213,6],[136,0,136,1],[143,2,143,8],[113,11,113,12],[113,3,113,5],[115,0,115,2],[124,0,124,3],[135,0,135,1],[117,6,117,8],[118,6,118,8],[114,6,114,7],[251,0,251,1],[146,11,146,12],[42,0,42,14],[270,13,270,14],[254,0,255,4],[254,9,255,10],[259,13,259,14],[256,13,256,14],[254,11,255,12],[260,11,260,12],[269,13,269,14],[91,0,91,2],[91,3,91,4],[20,0,22,0],[20,1,20,14],[1,3,2,14],[3,3,3,14],[1,0,4,2],[4,3,4,14],[287,2,287,14],[288,2,288,14],[260,9,260,10],[259,11,259,12],[40,0,40,14],[19,0,19,14],[302,2,302,14],[327,0,327,14],[302,0,305,1],[305,2,305,14],[116,3,116,5],[160,0,160,4],[159,0,159,4],[159,5,159,7],[160,5,160,7],[159,8,159,10],[160,8,160,10],[159,11,160,14],[22,1,22,14],[21,1,21,14],[163,5,163,6],[137,2,137,8],[112,0,112,14],[118,13,118,14],[102,0,102,2],[141,0,141,1],[43,0,43,14],[80,13,80,14],[76,9,76,14],[70,9,70,14],[266,0,266,1],[144,13,144,14],[203,7,203,8],[134,9,134,10],[136,13,136,14],[248,7,248,8],[146,13,146,14],[226,5,226,6],[247,7,247,8],[246,5,246,6],[246,0,246,4],[113,9,113,10],[113,13,113,14],[78,0,78,4],[93,5,93,6],[92,5,92,6],[79,5,79,6],[79,9,79,10],[70,3,70,8],[97,5,97,6],[96,0,96,2],[224,5,224,6],[113,6,113,8],[216,0,216,4],[93,0,93,2],[144,0,144,1],[64,0,64,14],[201,5,201,6],[18,9,18,14],[354,11,354,12],[353,13,353,14],[354,13,354,14],[223,2,223,8],[202,5,202,6],[242,3,243,8],[343,7,343,8],[343,9,343,10],[245,5,245,6],[18,7,18,8],[18,1,18,6],[244,3,244,8],[342,9,342,10],[248,0,248,4],[241,0,241,14],[199,2,199,8],[134,13,134,14],[270,3,270,9],[265,0,265,1],[26,0,26,14],[27,0,27,14],[28,0,28,14],[34,0,34,14],[258,13,258,14],[257,13,257,14],[256,11,256,12],[31,0,31,14],[272,3,272,9],[339,0,339,6],[333,0,333,6],[340,0,340,6],[300,2,300,11],[300,12,300,14],[340,7,340,8],[329,13,329,14],[355,11,355,12],[356,11,356,12],[353,11,353,12],[355,9,355,10],[356,9,356,10],[301,2,301,14],[356,7,356,8],[340,9,340,10],[306,0,306,14],[325,0,326,14],[334,11,334,12],[339,7,339,8],[346,13,346,14],[335,13,335,14],[349,0,349,6],[349,7,349,8],[329,7,329,8],[364,0,364,6],[332,0,332,4],[328,0,328,6],[342,7,342,8],[331,9,331,10],[345,9,345,10],[345,7,345,8],[358,7,358,8],[358,9,358,10],[355,7,355,8],[354,0,354,6],[359,13,359,14],[360,13,360,14],[345,0,345,6],[330,0,330,6],[347,7,347,8],[329,0,329,6],[286,2,286,14],[245,7,245,8],[256,9,256,10],[268,13,268,14],[257,9,257,10],[273,13,273,14],[269,0,275,2],[271,3,271,9],[344,0,344,4],[341,0,341,6],[358,0,358,6],[334,0,334,6],[260,0,260,3],[256,0,256,3],[347,0,347,6],[357,0,357,4],[347,9,347,10],[347,11,347,12],[340,11,340,12],[273,11,273,12],[258,11,258,12],[258,9,258,10],[304,2,304,14],[257,11,257,12],[267,0,267,1],[268,0,268,10],[274,13,274,14],[275,13,275,14],[274,11,274,12],[337,13,337,14],[408,12,408,14],[210,5,210,6],[354,7,354,8],[354,9,354,10],[161,0,161,14],[162,0,162,1],[162,2,162,14],[390,4,390,8],[391,4,391,6],[392,4,392,6],[393,4,393,6],[394,4,394,6],[392,2,392,3],[393,2,393,3],[338,0,338,4],[412,2,412,14],[413,0,413,1],[413,2,413,14],[381,12,381,14],[384,0,384,1],[247,5,247,6],[342,0,342,6],[343,0,343,6],[353,0,353,6],[247,0,247,4],[202,0,202,3],[328,7,328,8],[246,7,246,8],[216,7,216,8],[220,7,220,8],[215,0,215,1],[341,7,341,8],[437,7,438,14],[430,0,432,1],[430,2,430,14],[173,0,173,1],[172,0,172,1],[463,5,463,14],[463,2,463,4],[465,5,465,14],[437,0,438,6],[427,2,427,14],[426,0,426,13],[432,2,432,14],[185,0,185,14],[428,0,428,1],[429,0,429,1],[431,2,431,14],[433,0,433,6],[427,0,427,1],[429,2,429,14],[434,0,435,6],[436,7,436,14],[434,7,435,14],[453,0,453,14],[454,2,454,14],[454,0,454,1],[175,3,176,6],[238,7,238,8],[238,5,238,6],[238,0,238,4],[239,13,239,14],[239,11,239,12],[535,4,535,6],[536,4,536,6],[195,9,195,10],[195,11,195,12],[483,11,483,14],[481,11,481,14],[482,11,482,14],[495,11,495,14],[493,7,493,10],[472,7,472,10],[466,5,466,14],[472,4,472,6],[474,7,474,10],[475,7,475,10],[470,11,470,14],[477,7,477,10],[473,11,473,14],[466,2,466,4],[467,0,468,14],[479,11,479,14],[484,11,484,14],[485,11,485,14],[486,11,486,14],[493,11,493,14],[494,11,494,14],[469,0,469,14],[470,0,470,6],[470,7,470,10],[471,11,471,14],[462,5,462,14],[433,7,433,14],[436,0,436,6],[534,7,534,10],[535,7,535,10],[536,7,536,10],[192,0,192,14],[534,0,536,2],[518,7,518,10],[516,7,516,10],[516,11,516,14],[517,11,517,14],[525,11,525,14],[539,0,539,1],[534,4,534,6],[525,4,525,6],[526,4,526,6],[525,0,527,2],[538,0,538,14],[195,7,195,8],[194,13,194,14],[196,0,196,4],[196,7,196,8],[196,9,196,10],[194,11,194,12],[193,0,193,14],[196,13,196,14],[196,11,196,12],[194,0,194,6],[194,7,194,8],[527,4,527,6],[533,4,533,6],[528,0,530,2],[528,4,528,6],[529,4,529,6],[529,7,529,10],[532,7,532,10],[533,7,533,10],[522,4,522,6],[523,4,523,6],[524,4,524,6],[522,0,524,2],[520,4,520,6],[519,0,521,2],[516,4,516,6],[517,4,517,6],[516,0,518,2],[521,4,521,6],[520,7,520,10],[518,4,518,6],[524,7,524,10],[519,4,519,6],[530,4,530,6],[531,4,531,6],[554,0,554,1],[547,3,547,4],[557,3,557,4],[556,3,556,4],[555,3,555,4],[548,3,548,4],[548,0,548,1],[549,0,549,1],[550,0,550,1],[551,0,551,1],[552,0,552,1],[552,3,552,4],[549,3,549,4],[550,3,550,4],[551,3,551,4],[547,0,547,1],[557,0,557,1],[556,0,556,1],[555,0,555,1],[553,3,553,4],[554,3,554,4],[553,0,553,1]],"merged_total":1412,"flags":["merged_cut"]}
["STARTING WELL : WEST SUSSEX HEALTHY CHILDREN & FAMILY CENTRE PROFILE November 2014"]
[null,null,null,"This data profile provides information on progress on health and other performance indicators.  It has been developed to support the performance management of the West Sussex Healthy Children and Family Centre programme, and Ofsted inspection requirements.   "]
[]
[null,null,null,"The information collated forms part of the West Sussex Joint Strategic Needs Assessment."]
[null,null,null,"The profile enables you to look at individual children and family centres, or groups of centres, and to compare the performance of two different centres/groups at a time. Note: not all data are available at all geographies"]
[null,"Select Centre / Group",null,null,null,null,null,null,null,null,null,"Select by choosing from the drop down list"]
[null,"Select Comparator Centre / Group",null,null,null,null,null,null,null,null,null,"Select by choosing from the drop down list"]
[]
[]
[]
[]
[]
[]
[]
[]
[]
["The data has been collated by the West Sussex Research Unit working with colleagues in the NHS and West Sussex County Council. It will be updated on a six monthly basis. The inclusion of further indicators, some outlined in this profile, will be considered at the next refresh."]
["If you need further information please email jsna@westsussex.gov.uk"]
["Date","November 2014",null,null,null,null,null,"Next update due",null,"October 2015"]
["INFORMATION IN THIS PROFILE"]
["Note ","Where possible data are provided at individual centre level, but where the information is not available, or where numbers are very small, information is shown for a group of centres or larger geographical area. Regional and national figures are included where available."]
[null,"95% confidence intervals are shown and should be used when making comparisons. Where confidence intervals overlap, it is not possible to say that a difference is statistically significant. In the main, siginificance relates to whether an area is significantly different in comparison to England averages."]
[null,"There are some brief notes included on statistical issues; a more detailed technical appendix is available."]
["WEST SUSSEX HEALTHY CHILDREN AND FAMILY CENTRE PROGRAMME"]
["The West Sussex Healthy Children and Family Centre Programme has nine priorities, these are:"]
["• Healthy weight, healthy lives (breastfeeding, healthy eating and physical activity)"]
["• Improving the oral health of children"]
["• Improving children’s emotional health and well-being and adult mental health"]
["• Improving children’s speech, language and communication"]
["• Reducing teenage pregnancy rates and supporting teenage parents"]
["• Reducing alcohol and substance misuse"]
["• Increasing smoking cessation"]
["• Improving cover rate for all childhood immunisations"]
["• Reducing unintentional injuries to children and risk of sudden infant death."]
["KEY PERFORMANCE INDICATORS (OFSTED)"]
["• Percentage of children being breastfed at six to eight weeks "]
["• Percentage of children in reception year who are obese "]
["• Rate of emergency hospital admissions caused by unintentional and deliberate injuries to children and young people "]
["•  The achievement of children who have accessed services provided or commissioned by the centre, shown by the percentage of children gaining at least 78 points across the Early Years Foundation Stage Profile scales with at least six points in each of the"]
["• Percentage of children aged 0–4 living in households dependent on workless benefits"]
["• Percentage of eligible families benefiting from the childcare element of Working Tax Credit "]
["The following indicators rely on information collected / available at each centre."]
["• Percentage of each of the following target groups in the children’s centre reach area and with whom the children’s centre establishes contact: teenage parents and pregnant teenagers, lone parents, children in workless households, children in minority ethnic groups, disabled children and children of disabled parents, fathers, other groups that are priority vulnerable groups in the children’s centre area "]
["• Any evidence on the percentage of parents of children aged 0–5 in the children’s centre area who are satisfied with the services"]
["CONTENTS"]
["CLICK ON SUBJECT TO GO TO THE DATA. Not all data available at all geographies."]
[]
[null,"Background Data",null,null,null,"Family Structure and Composition",null,null,null,null,"Health indicators"]
[null,null,"Geographies",null,null,null,"Family size (families with a 0-4 yr old)",null,null,null,null,"Breastfeeding (at CFC level)"]
[null,null,"Overall population",null,null,null,"Couple/non-couple households (with 0-4yrs)",null,null,null,null,"Breastfeeding (CCG DoH published data)"]
[null,null,"Population of 0-4 year olds",null,null,null,"Census 2011 data - lone parents",null,null,null,null,"Childhood obesity (reception)"]
[null,null,"Ethnicity - 0-4 year olds",null,null,null,"Lone parent families on low income",null,null,null,null,"Childhood obesity (Year 6)"]
[null,null,"Proficiency in English (relates to 3-15yr olds)",null,null,null,null,null,null,null,null,"Oral Health"]
[null,null,"Tenure (relates to 0-9 yr olds)",null,null,null,null,null,null,null,null,"Mental health "]
[null,null,null,null,null,null,null,null,null,null,null,"Identification of Post Natal Depression"]
[null,"Births and Early Health Status",null,null,null,"Deprivation",null,null,null,null,null,"Smoking in pregnancy/in new born households"]
[null,null,"Births",null,null,null,"ID2010 Deprivation decile (location of CFC)",null,null,null,null,"Immunisations"]
[null,null,"Births to women aged under 20 years",null,null,null,"Census 2011 % of households 3/4 measures"]
[null,null,"Estimation of teenage mothers in area",null,null,null,"0-4yr olds in workless households",null,null,null,"Early Years Foundation Stage Measures"]
[null,null,"Teenage pregnancy",null,null,null,"Child Poverty",null,null,null,null,"% of Children \"Good Level of Development\" "]
[null,null,"Low birth weight",null,null,null,null,null,null,null,null,"Gap between lowest scores and median score"]
[null,null,"0-4 yrs with daily activities limited"]
[]
["BACKGROUND INFORMATION",null,null,null,null,null,null,null,null,null,null,null,null,null,"back to top"]
["Geographies - CHILDREN AND FAMILY CENTRES ONLY"]
["This page provides information on the location of the children and family centre and the population it serves. "]
["  - CFC Group - Children and Family Centres (CFCs) in West Sussex are aggregated into 12 CFC groups."]
["  - Education LOCALITY area refers to groupings established for schools in West Sussex. There are 24 locality groups in West Sussex"]
["  - Education PARTNERSHIP AREAS - there are 5 Partnership areas in West Sussex"]
["Other geographies (CFC Groups, LAs etc) cover numerous geographies fields are left blank. "]
["Centre location and grouping. ",null,null,{"$f":"HLOOKUP(DATA!$A$2,DATA!$A$2:$A$77,DATA!$A$1+1,FALSE)","v":"Kingston Buci"},null,null,null,null,null,{"$f":"HLOOKUP(DATA!$A$2,DATA!$A$2:$A$77,DATA!$B$1+1,FALSE)","v":"Stepping Stones"}]
[null,null,null,"CFC Group",null,"Ward(s) Located",null,"District",null,"CFC Group",null,"Ward(s) Located",null,"District"]
[null,null,null,{"$f":"VLOOKUP($D$71,DATA!$A$3:$K$69,4,FALSE)","v":"Adur East"},null,{"$f":"VLOOKUP($D$71,DATA!$A$3:$K$69,7,FALSE)","v":"Buckingham, St Mary's, St Nicolas, Southlands"},null,{"$f":"VLOOKUP($D$71,DATA!$A$3:$K$69,5,FALSE)","v":"Adur"},null,{"$f":"VLOOKUP($J$71,DATA!$A$3:$K$69,4,FALSE)","v":"Adur East"},null,{"$f":"VLOOKUP($J$71,DATA!$A$3:$K$69,7,FALSE)","v":"Eastbrook, Hillside, Southwich Green"},null,{"$f":"VLOOKUP($J$71,DATA!$A$3:$K$69,5,FALSE)","v":"Adur"}]
["EDUCATION Locality Name",null,null,{"$f":"VLOOKUP($D$71,DATA!$A$3:$K$69,8,FALSE)","v":"Shoreham"},null,null,null,null,null,{"$f":"VLOOKUP($J$71,DATA!$A$3:$K$69,8,FALSE)","v":"Shoreham"}]
["EDUCATION Partnership Area",null,null,{"$f":"VLOOKUP($D$71,DATA!$A$3:$K$69,9,FALSE)","v":"B"},null,null,null,null,null,{"$f":"VLOOKUP($J$71,DATA!$A$3:$K$69,9,FALSE)","v":"B"}]
["CCG",null,null,{"$f":"VLOOKUP($D$71,DATA!$A$3:$K$69,10,FALSE)","v":"Coastal West Sussex"},null,null,null,null,null,{"$f":"VLOOKUP($J$71,DATA!$A$3:$K$69,10,FALSE)","v":"Coastal West Sussex"}]
["Parliamentary Constituency",null,null,{"$f":"VLOOKUP($D$71,DATA!$A$3:$K$69,11,FALSE)","v":"East Worthing and Shoreham"},null,null,null,null,null,{"$f":"VLOOKUP($J$71,DATA!$A$3:$K$69,11,FALSE)","v":"East Worthing and Shoreham"}]
["Population ",null,null,null,null,null,null,null,null,null,null,null,null,null,"back to top"]
["Source: ONS Mid Year Estimates 2013",null,null,null,null,{"$f":"$D$71","v":"Kingston Buci"},null,{"$f":"$J$71","v":"Stepping Stones"},null,"West Sussex",null,"South East",null,"England"]
["Population (2013)",null,null,null,null,{"$f":"HLOOKUP($A80,_cfc1,DATA!A$1+1,FALSE)","v":15185},null,{"$f":"HLOOKUP($A80,_cfc1,DATA!B$1+1,FALSE)","v":13390},null,821400,null,8792600,null,53865800]
["Under 5 (2013)",null,null,null,null,{"$f":"HLOOKUP($A81,_cfc1,DATA!A$1+1,FALSE)","v":990},null,{"$f":"HLOOKUP($A81,_cfc1,DATA!B$1+1,FALSE)","v":830},null,47800,null,547500,null,3414100]
["Population of Children 0-4 "]
["Source: ONS Small Area Population Statistics (Experimental Stats)",null,null,{"$f":"$D$71","v":"Kingston Buci"},null,{"$f":"$J$71","v":"Stepping Stones"}]
[null,null,null,{"$f":"$D$71","v":"Kingston Buci"},null,{"$f":"$J$71","v":"Stepping Stones"}]
["Under 5 (2004)",null,null,{"$f":"HLOOKUP(A85,cfc,DATA!A$1+1,FALSE)","v":770},null,{"$f":"HLOOKUP(A85,cfc,DATA!B$1+1,FALSE)","v":700}]
["Under 5 (2005)",null,null,{"$f":"HLOOKUP(A86,cfc,DATA!A$1+1,FALSE)","v":775},null,{"$f":"HLOOKUP(A86,cfc,DATA!B$1+1,FALSE)","v":680}]
["Under 5 (2006)",null,null,{"$f":"HLOOKUP(A87,cfc,DATA!A$1+1,FALSE)","v":805},null,{"$f":"HLOOKUP(A87,cfc,DATA!B$1+1,FALSE)","v":705}]
["Under 5 (2007)",null,null,{"$f":"HLOOKUP(A88,cfc,DATA!A$1+1,FALSE)","v":800},null,{"$f":"HLOOKUP(A88,cfc,DATA!B$1+1,FALSE)","v":710}]
["Under 5 (2008)",null,null,{"$f":"HLOOKUP(A89,cfc,DATA!A$1+1,FALSE)","v":830},null,{"$f":"HLOOKUP(A89,cfc,DATA!B$1+1,FALSE)","v":735}]
["Under 5 (2009)",null,null,{"$f":"HLOOKUP(A90,cfc,DATA!A$1+1,FALSE)","v":815},null,{"$f":"HLOOKUP(A90,cfc,DATA!B$1+1,FALSE)","v":775}]
["Under 5 (2010)",null,null,{"$f":"HLOOKUP(A91,cfc,DATA!A$1+1,FALSE)","v":860},null,{"$f":"HLOOKUP(A91,cfc,DATA!B$1+1,FALSE)","v":775}]
["Under 5 (2011)",null,null,{"$f":"HLOOKUP(A92,cfc,DATA!A$1+1,FALSE)","v":905},null,{"$f":"HLOOKUP(A92,cfc,DATA!B$1+1,FALSE)","v":805}]
["Under 5 (2012)",null,null,{"$f":"HLOOKUP(A93,cfc,DATA!A$1+1,FALSE)","v":945},null,{"$f":"HLOOKUP(A93,cfc,DATA!B$1+1,FALSE)","v":825}]
["Under 5 (2013)",null,null,{"$f":"HLOOKUP(A94,cfc,DATA!A$1+1,FALSE)","v":990},null,{"$f":"HLOOKUP(A94,cfc,DATA!B$1+1,FALSE)","v":830}]
["Ethnic Composition",null,null,null,null,null,null,null,null,null,null,null,null,null,"back to top"]
["Data is for children aged 0-4 years and is taken from the 2011 Census."]
["Source: 2011 Census",null,null,{"$f":"$D$71","v":"Kingston Buci"},null,{"$f":"$J$71","v":"Stepping Stones"},null,"West Sussex"]
["% White British",null,null,{"$f":"HLOOKUP(A98,cfc,DATA!A1+1,FALSE)","v":0.89910313901345296},null,{"$f":"HLOOKUP(A98,cfc,DATA!B$1+1,FALSE)","v":0.88930348258706471},null,0.83599999999999997]
["% White Irish and White Other",null,null,{"$f":"HLOOKUP(A99,cfc,DATA!A1+1,FALSE)","v":2.1300448430493273E-2},null,{"$f":"HLOOKUP(A99,cfc,DATA!B$1+1,FALSE)","v":1.8656716417910446E-2},null,4.3999999999999997E-2]
["% Mixed/Multiple",null,null,{"$f":"HLOOKUP(A100,cfc,DATA!A$1+1,FALSE)","v":4.708520179372197E-2},null,{"$f":"HLOOKUP(A100,cfc,DATA!B$1+1,FALSE)","v":3.3582089552238806E-2},null,4.7E-2]
["% Asian",null,null,{"$f":"HLOOKUP(A101,cfc,DATA!A$1+1,FALSE)","v":2.8026905829596414E-2},null,{"$f":"HLOOKUP(A101,cfc,DATA!B$1+1,FALSE)","v":3.109452736318408E-2},null,5.5E-2]
["% Black",null,null,{"$f":"HLOOKUP(A102,cfc,DATA!A$1+1,FALSE)","v":0},null,{"$f":"HLOOKUP(A102,cfc,DATA!B$1+1,FALSE)","v":7.462686567164179E-3},null,1.2999999999999999E-2]
["% Other",null,null,{"$f":"HLOOKUP(A103,cfc,DATA!A$1+1,FALSE)","v":4.4843049327354259E-3},null,{"$f":"HLOOKUP(A103,cfc,DATA!B$1+1,FALSE)","v":1.9900497512437811E-2},null,5.0000000000000001E-3]
["% BAME (Under 5)",null,null,{"$f":"D99+D100+D101+D102+D103","v":0.10089686098654709},null,{"$f":"F99+F100+F101+F102+F103","v":0.11069651741293532},null,0.16500000000000001]
["* BAME (Black Asian and Ethnic Minority) includes White Irish and White Other and Other. This data relates to children aged under 5 only."]
["Proficiency in English (Children 3 to 15 Years) Source Census 2011"]
["Source: 2011 Census",null,null,null,null,null,null,{"$f":"$D$71","v":"Kingston Buci"},null,{"$f":"$J$71","v":"Stepping Stones"},null,"West Sussex",null,"England"]
["Proficiency in English",null,null,null,null,null,"Proficiency in English 2011",{"$f":"HLOOKUP($G108,cfc,DATA!$A$1+1,FALSE)","v":2048},null,{"$f":"HLOOKUP($G108,cfc,DATA!B$1+1,FALSE)","v":2004},null,{"$f":"DATA!FT75","v":117072},null,{"$f":"DATA!FT77","v":8015990}]
["Main language is English",null,null,null,null,null,"3-15 Main language is English 2011",{"$f":"HLOOKUP($G109,cfc,DATA!$A$1+1,FALSE)","v":2022},null,{"$f":"HLOOKUP($G109,cfc,DATA!B$1+1,FALSE)","v":1951},null,{"$f":"DATA!FU75","v":113395},null,{"$f":"DATA!FU77","v":7549840}]
["Main language is not English",null,null,null,null,null,"3-15 Main language is not English 2011",{"$f":"HLOOKUP($G110,cfc,DATA!$A$1+1,FALSE)","v":26},null,{"$f":"HLOOKUP($G110,cfc,DATA!B$1+1,FALSE)","v":53},null,{"$f":"DATA!FV75","v":3677},null,{"$f":"DATA!FV77","v":466150}]
["Main language is not English but can speak English well or very well",null,null,null,null,null,"3-15 Main language is not English : Can speak English very well or well 2011",{"$f":"HLOOKUP($G111,cfc,DATA!$A$1+1,FALSE)","v":22},null,{"$f":"HLOOKUP($G111,cfc,DATA!B$1+1,FALSE)","v":51},null,{"$f":"DATA!FW75","v":3091},null,{"$f":"DATA!FW77","v":390060}]
["Main language is not English and cannot speak it or speak it well",null,null,null,null,null,"3-15 Main language is not English : Cannot speak English or cannot speak English well 2011",{"$f":"HLOOKUP($G112,cfc,DATA!$A$1+1,FALSE)","v":4},null,{"$f":"HLOOKUP($G112,cfc,DATA!B$1+1,FALSE)","v":2},null,{"$f":"DATA!FX75","v":586},null,{"$f":"DATA!FX77","v":76090}]
["Households - Tenure of Households with a Child aged 0-9 Years"]
["Source: 2011 Census",null,null,{"$f":"$D$71","v":"Kingston Buci"},null,null,{"$f":"$J$71","v":"Stepping Stones"},null,null,"West Sussex",null,"South East",null,"England"]
[null,null,null,"Households",null,"%","Households",null,"%","% of Households"]
["Households with a child aged 0-9 years",null,null,{"$f":"HLOOKUP(A116,cfc,DATA!A1+1,FALSE)","v":1660},null,1,{"$f":"HLOOKUP(A116,cfc,DATA!B$1+1,FALSE)","v":1550},null,1]
["% Owned",null,null,{"$f":"HLOOKUP($A117,cfc,DATA!A$1+1,FALSE)","v":0.59975889089813139},null,null,{"$f":"HLOOKUP($A117,cfc,DATA!B$1+1,FALSE)","v":0.59199483537766295},null,null,0.622,null,0.60099999999999998,null,0.55200000000000005]
["% Social Rented",null,null,{"$f":"HLOOKUP($A118,cfc,DATA!A$1+1,FALSE)","v":0.20253164556962025},null,null,{"$f":"HLOOKUP($A118,cfc,DATA!B$1+1,FALSE)","v":0.20787604906391219},null,null,0.17299999999999999,null,0.17199999999999999,null,0.214]
["% Private Rent/Living Rent Free",null,null,{"$f":"HLOOKUP($A119,cfc,DATA!A$1+1,FALSE)","v":0.19770946353224833},null,null,{"$f":"HLOOKUP($A119,cfc,DATA!B$1+1,FALSE)","v":0.2001291155584248},null,null,0.20499999999999999,null,0.22600000000000001,null,0.23200000000000001]
["In West Sussex the pattern of social housing, closely aligns with deprivation. At a small area level the level of social housing is a useful indicator of additional need. "]
[{"$f":"D114","v":"Kingston Buci"},null,null,null,null,null,null,null,null,{"$f":"J114","v":"West Sussex"}]
[]
[]
[]
[null,null,null,null,null,null,null,"Owner Occupied"]
[null,null,null,null,null,null,null,"Social Rented"]
[null,null,null,null,null,null,null,"Private Rent / Rent Free"]
[]
[]
["BIRTHS",null,null,null,null,null,null,null,null,null,null,null,null,"back to top"]
["Information on births at a local level can be volatile, they are included in this profile to provide scale (approximate number of children per year) and general direction (are numbers going up / down) over a number of years. "]
["All Births "]
["Statistical Issues",null,"This information is taken directly from the Child Health Bureau and usual residence postcode of birth has been allocated to individual CFC catchment areas."]
[null,null,"To allocate to catchment areas full postcodes are required. There were a number of records where the postcode was incomplete or missing, this means that the total number of births is lower than reported by ONS."]
["Source: Child Health Bureau",null,null,null,null,null,null,null,null,{"$f":"$D$71","v":"Kingston Buci"},null,{"$f":"$J$71","v":"Stepping Stones"},null,"West Sussex"]
[null,null,"All Births (2009)",null,null,null,null,null,null,{"$f":"HLOOKUP(C136,cfc,DATA!A1+1,FALSE)","v":150},null,{"$f":"HLOOKUP(C136,cfc,DATA!B$1+1,FALSE)","v":109},null,{"$f":"DATA!AQ$75","v":8927}]
[null,null,"All Births (2010)",null,null,null,null,null,null,{"$f":"HLOOKUP(C137,cfc,DATA!A1+1,FALSE)","v":168},null,{"$f":"HLOOKUP(C137,cfc,DATA!B$1+1,FALSE)","v":125},null,{"$f":"DATA!AR$75","v":9024}]
[null,null,"All Births (2011)",null,null,null,null,null,null,{"$f":"HLOOKUP(C138,cfc,DATA!A1+1,FALSE)","v":169},null,{"$f":"HLOOKUP(C138,cfc,DATA!B$1+1,FALSE)","v":107},null,{"$f":"DATA!AS$75","v":9198}]
[null,null,"All Births (2012)",null,null,null,null,null,null,{"$f":"HLOOKUP(C139,cfc,DATA!A1+1,FALSE)","v":178},null,{"$f":"HLOOKUP(C139,cfc,DATA!B$1+1,FALSE)","v":138},null,{"$f":"DATA!AT$75","v":9207}]
[null,null,"All Births (2013)",null,null,null,null,null,null,{"$f":"HLOOKUP(C140,cfc,DATA!A1+1,FALSE)","v":202},null,{"$f":"HLOOKUP(C140,cfc,DATA!B$1+1,FALSE)","v":115},null,8603]
["Births to Mothers Aged Under 20"]
["Statistical Issues",null,"Young mothers, first time mothers under the age of 20, are a target group for the work of Family Nurse Partnerships. Not all maternity records used a \"flag\" for first time mothers, therefore the information provided below relates to all mothers under the age of 20, the majority of these mothers will be first time mothers"]
["Source: Child Health Bureau",null,null,null,null,null,null,null,null,{"$f":"$D$71","v":"Kingston Buci"},null,{"$f":"$J$71","v":"Stepping Stones"},null,"West Sussex"]
[null,null,"Births to Mothers Under 20 (2009)",null,null,null,null,null,null,{"$f":"HLOOKUP(C144,cfc,DATA!A$1+1,FALSE)","v":7},null,{"$f":"HLOOKUP(C144,cfc,DATA!B$1+1,FALSE)","v":10},null,{"$f":"DATA!AV$75","v":456}]
[null,null,"Births to Mothers Under 20 (2010)",null,null,null,null,null,null,{"$f":"HLOOKUP(C145,cfc,DATA!A$1+1,FALSE)","v":5},null,{"$f":"HLOOKUP(C145,cfc,DATA!B$1+1,FALSE)","v":7},null,{"$f":"DATA!AW$75","v":399}]
[null,null,"Births to Mothers Under 20 (2011)",null,null,null,null,null,null,{"$f":"HLOOKUP(C146,cfc,DATA!A$1+1,FALSE)","v":7},null,{"$f":"HLOOKUP(C146,cfc,DATA!B$1+1,FALSE)","v":5},null,{"$f":"DATA!AX$75","v":367}]
[null,null,"Births to Mothers Under 20 (2012)",null,null,null,null,null,null,{"$f":"HLOOKUP(C147,cfc,DATA!A$1+1,FALSE)","v":4},null,{"$f":"HLOOKUP(C147,cfc,DATA!B$1+1,FALSE)","v":7},null,{"$f":"DATA!AY$75","v":345}]
[null,null,"Births to Mothers Under 20 (2013)",null,null,null,null,null,null,{"$f":"HLOOKUP(C148,cfc,DATA!A$1+1,FALSE)","v":6},null,{"$f":"HLOOKUP(C148,cfc,DATA!B$1+1,FALSE)","v":7},null,{"$f":"DATA!AZ$75","v":331}]
["  Total Number of Births and Births to Women Aged Under 20"]
[null,null,{"$f":"J143","v":"Kingston Buci"},null,null,null,null,null,null,{"$f":"L143","v":"Stepping Stones"}]
[null,null,null,null,null,null,null,null,null,"Under 20","All Births",null,"Under 20","All Births"]
[null,null,null,null,null,null,null,null,"2009",{"$f":"J144","v":7},{"$f":"J136-J144","v":143},2008,{"$f":"L144","v":10},{"$f":"L136-L144","v":99}]
[null,null,null,null,null,null,null,null,"2010",{"$f":"J145","v":5},{"$f":"J137-J145","v":163},2009,{"$f":"L145","v":7},{"$f":"L137-L145","v":118}]
[null,null,null,null,null,null,null,null,"2011",{"$f":"J146","v":7},{"$f":"J138-J146","v":162},2010,{"$f":"L146","v":5},{"$f":"L138-L146","v":102}]
[null,null,null,null,null,null,null,null,2012,{"$f":"J147","v":4},{"$f":"J139-J147","v":174},2011,{"$f":"L147","v":7},{"$f":"L139-L147","v":131}]
[]
["Estimation of the number of teenage mothers/parents in the CFC catchment area."]
["There is no reliable data source providing an estimate of the total number of teenage mothers/parents in a centre catchment area. The figure below relates to the total number of births mapped in the area where the mothers age was known, and the home postcodes at the time of birth was within the CFC ctachment area. This data should be used with caution, there may be some double counting of mothers (where women have a number of births in their teenage years) and this is likely to be a fairly mobile population."]
["The figures have been calculated by combining births in 2013 to mothers under 20 years, births in 2012 to mothers under 19 years, births in 2011 to mothers under 18 years, births in 2010 to mothers under 17 years, births in 2009 to mothers under 16 years and births in 2008 to mothers aged 15 years."]
[null,null,null,null,null,{"$f":"$D$71","v":"Kingston Buci"},null,null,{"$f":"$J$71","v":"Stepping Stones"}]
["Estimation of teenage mothers in area",null,null,null,null,{"$f":"HLOOKUP(A161,cfc,DATA!A$1+1,FALSE)","v":9},null,null,{"$f":"HLOOKUP(A161,cfc,DATA!B$1+1,FALSE)","v":15}]
["Low Birth Weight"]
["Statistical Issues",null,"The data shows the number and percentage of babies born of weight less than 2.5kg. The data relates to 2013 and single year data should be treated with caution."]
["Source: Child Health Bureau",null,null,{"$f":"$D$71","v":"Kingston Buci"},null,{"$f":"$J$71","v":"Stepping Stones"}]
["Number of babies born of low weight",null,null,{"$f":"HLOOKUP(A165,cfc,DATA!A$1+1,FALSE)","v":16},null,{"$f":"HLOOKUP(A165,cfc,DATA!B$1+1,FALSE)","v":5},null,{"$f":"D164","v":"Kingston Buci"},{"$f":"F164","v":"Stepping Stones"}]
["% low weight",null,null,{"$f":"HLOOKUP(A166,cfc,DATA!A$1+1,FALSE)","v":7.9207920792079209E-2},null,{"$f":"HLOOKUP(A166,cfc,DATA!B$1+1,FALSE)","v":4.3478260869565216E-2},null,{"$f":"D166","v":7.9207920792079209E-2},{"$f":"F166","v":4.3478260869565216E-2}]
["LCL",null,null,{"$f":"HLOOKUP(A167,cfc,DATA!A$1+1,FALSE)","v":4.9341090217535556E-2},null,{"$f":"HLOOKUP(A167,cfc,DATA!B$1+1,FALSE)","v":1.8712101106831382E-2},null,{"$f":"D166-D167","v":2.9866830574543653E-2},{"$f":"F166-F167","v":2.4766159762733834E-2}]
["UCL",null,null,{"$f":"HLOOKUP(A168,cfc,DATA!A$1+1,FALSE)","v":0.12478058102419014},null,{"$f":"HLOOKUP(A168,cfc,DATA!B$1+1,FALSE)","v":9.7757849346889233E-2},null,{"$f":"D168-D166","v":4.5572660232110929E-2},{"$f":"F168-F166","v":5.4279588477324017E-2}]
[]
["PREGNANCY",null,null,null,null,null,null,null,null,null,null,null,null,"back to top"]
["REDUCING TEENAGE PREGNANCY AND SUPPORTING TEENAGE PARENTS"]
["Why teenage pregnancy is important",null,"Teenage mothers are more likely than other mothers to experience a range of negative outcomes including low educational attainment, poverty, poor health including poor mental health, and poor housing.  Their children have three times the risk of infant mortality, and are more likely to grow up in poverty and become teenage parents themselves, perpetuating a cycle of disadvantage.  Preventing teenage pregnancy allows teenagers to fulfil their potential and contribute to society."]
["Rationale for the indicator",null,"Teenage pregnancy is associated with deprivation and poverty and the overall rate in West Sussex, an affluent county, is low.  However there is variation around the county and children and family centres need to be aware of the needs of their local populations.  This indicator shows the number of teenage parents within the catchment area of the centre so that centres can ensure they have capacity to proactively provide appropriate support."]
["What helps?",null,"Services for teenage parents are provided by a number of agencies including health, social services, education, youth services and the voluntary sector.  It is important that they are as integrated as possible, and are welcoming to young people. Children and family centres have an invaluable role in supporting young parents to improve health, social and economic outcomes for them and their children and in preventing subsequent pregnancies."]
["Statistical issues",null,"Numbers of teenage conceptions in each ward are very small and it is not possible to calculate rates at centre level."]
["Teenage Conception - Ward",null,null,{"$f":"IF(D71=\"Littlehampton\",\"Ham\",\"Not significantly higher than England rate\")","v":"Not significantly higher than England rate"},null,null,null,"Data is only shown for wards which have rates significantly above the England rate. The ward shown is the ward the centre is located in."]
[]
[null,null,null,{"$f":"H73","v":"Adur"},null,null,null,"West Sussex",null,null,null,"England"]
[null,null,null,"LA - Number","LA Rate per 1,000","LCL","LA - UCL","Number","Rate per 1,000","LCL","UCL","Number","Rate per 1,000","LCL","UCL"]
[null,null,"2005-2007",{"$f":"VLOOKUP($D$178,pt,2,FALSE)","v":133},{"$f":"VLOOKUP($D$178,pt,3,FALSE)","v":37.299999999999997},{"$f":"VLOOKUP($D$178,pt,4,FALSE)","v":31.230511007813849},{"$f":"VLOOKUP($D$178,pt,5,FALSE)","v":44.204716298407554},{"$f":"VLOOKUP($H$178,pt,2,FALSE)","v":1284},{"$f":"VLOOKUP($H$178,pt,3,FALSE)","v":30.196843912419745},{"$f":"VLOOKUP($H$178,pt,4,FALSE)","v":28.567535104483948},{"$f":"VLOOKUP($H$178,pt,5,FALSE)","v":31.894859642287095},{"$f":"VLOOKUP($L$178,pt,2,FALSE)","v":119272},{"$f":"VLOOKUP($L$178,pt,3,FALSE)","v":41.2},{"$f":"VLOOKUP($L$178,pt,4,FALSE)","v":40.966510345412779},{"$f":"VLOOKUP($L$178,pt,5,FALSE)","v":41.434490411159572}]
[null,null,"2006-2008",{"$f":"VLOOKUP($D$178,pt,6,FALSE)","v":119},{"$f":"VLOOKUP($D$178,pt,7,FALSE)","v":33.1},{"$f":"VLOOKUP($D$178,pt,8,FALSE)","v":27.420605916369514},{"$f":"VLOOKUP($D$178,pt,9,FALSE)","v":39.609084951901316},{"$f":"VLOOKUP($H$178,pt,6,FALSE)","v":1337},{"$f":"VLOOKUP($H$178,pt,7,FALSE)","v":31.2},{"$f":"VLOOKUP($H$178,pt,8,FALSE)","v":29.6},{"$f":"VLOOKUP($H$178,pt,9,FALSE)","v":32.9},{"$f":"VLOOKUP($L$178,pt,6,FALSE)","v":118319},{"$f":"VLOOKUP($L$178,pt,7,FALSE)","v":41},{"$f":"VLOOKUP($L$178,pt,8,FALSE)","v":40.700000000000003},{"$f":"VLOOKUP($L$178,pt,9,FALSE)","v":41.2}]
[null,null,"2007-2009",{"$f":"VLOOKUP($D$178,pt,10,FALSE)","v":119},{"$f":"VLOOKUP($D$178,pt,11,FALSE)","v":32.9},{"$f":"VLOOKUP($D$178,pt,12,FALSE)","v":27.6},{"$f":"VLOOKUP($D$178,pt,13,FALSE)","v":39.200000000000003},{"$f":"VLOOKUP($H$178,pt,10,FALSE)","v":1341},{"$f":"VLOOKUP($H$178,pt,11,FALSE)","v":31.3},{"$f":"VLOOKUP($H$178,pt,12,FALSE)","v":29.7},{"$f":"VLOOKUP($H$178,pt,13,FALSE)","v":33},{"$f":"VLOOKUP($L$178,pt,10,FALSE)","v":115115},{"$f":"VLOOKUP($L$178,pt,11,FALSE)","v":40.200000000000003},{"$f":"VLOOKUP($L$178,pt,12,FALSE)","v":39.9},{"$f":"VLOOKUP($L$178,pt,13,FALSE)","v":40.4}]
[null,null,"2008-2010",{"$f":"VLOOKUP($D$178,pt,14,FALSE)","v":107},{"$f":"VLOOKUP($D$178,pt,15,FALSE)","v":29.9},{"$f":"VLOOKUP($D$178,pt,16,FALSE)","v":24.8},{"$f":"VLOOKUP($D$178,pt,17,FALSE)","v":36},{"$f":"VLOOKUP($H$178,pt,14,FALSE)","v":1281},{"$f":"VLOOKUP($H$178,pt,15,FALSE)","v":30.1},{"$f":"VLOOKUP($H$178,pt,16,FALSE)","v":28.5},{"$f":"VLOOKUP($H$178,pt,17,FALSE)","v":31.8},{"$f":"VLOOKUP($L$178,pt,14,FALSE)","v":107301},{"$f":"VLOOKUP($L$178,pt,15,FALSE)","v":38.1},{"$f":"VLOOKUP($L$178,pt,16,FALSE)","v":37.799999999999997},{"$f":"VLOOKUP($L$178,pt,17,FALSE)","v":38.299999999999997}]
[null,null,"2009-2011",{"$f":"VLOOKUP($D$178,pt,18,FALSE)","v":108},{"$f":"VLOOKUP($D$178,pt,19,FALSE)","v":33.200000000000003},{"$f":"VLOOKUP($D$178,pt,20,FALSE)","v":27.6},{"$f":"VLOOKUP($D$178,pt,21,FALSE)","v":39.9},{"$f":"VLOOKUP($H$178,pt,18,FALSE)","v":1120},{"$f":"VLOOKUP($H$178,pt,19,FALSE)","v":27},{"$f":"VLOOKUP($H$178,pt,20,FALSE)","v":25.4},{"$f":"VLOOKUP($H$178,pt,21,FALSE)","v":28.6},{"$f":"VLOOKUP($L$178,pt,18,FALSE)","v":97684},{"$f":"VLOOKUP($L$178,pt,19,FALSE)","v":34},{"$f":"VLOOKUP($L$178,pt,20,FALSE)","v":33.799999999999997},{"$f":"VLOOKUP($L$178,pt,21,FALSE)","v":34.200000000000003}]
[null,null,"2010-2012",{"$f":"VLOOKUP($D$178,TeenPreg!$A$1:$Y$10,22,FALSE)","v":98},{"$f":"VLOOKUP($D$178,TeenPreg!$A$1:$Y$10,23,FALSE)","v":30.6},{"$f":"VLOOKUP($D$178,TeenPreg!$A$1:$Y$10,24,FALSE)","v":25.2},{"$f":"VLOOKUP($D$178,TeenPreg!$A$1:$Y$10,25,FALSE)","v":37.200000000000003},{"$f":"VLOOKUP($H$178,TeenPreg!$A$1:$Y$10,22,FALSE)","v":1016},{"$f":"VLOOKUP($H$178,TeenPreg!$A$1:$Y$10,23,FALSE)","v":24.6},{"$f":"VLOOKUP($H$178,TeenPreg!$A$1:$Y$10,24,FALSE)","v":23.2},{"$f":"VLOOKUP($H$178,TeenPreg!$A$1:$Y$10,25,FALSE)","v":26.2},{"$f":"VLOOKUP($L$178,TeenPreg!$A$1:$Y$10,22,FALSE)","v":87875},{"$f":"VLOOKUP($L$178,TeenPreg!$A$1:$Y$10,23,FALSE)","v":30.9},{"$f":"VLOOKUP($L$178,TeenPreg!$A$1:$Y$10,24,FALSE)","v":30.7},{"$f":"VLOOKUP($L$178,TeenPreg!$A$1:$Y$10,25,FALSE)","v":31.1}]
["Graph showing District, County and England Teenage Conception Rates (Births per 1,000 women aged 15-17 years) 2005-7 to 2009-11"]
[null,null,null,null,null,{"$f":"G180-E180","v":6.904716298407557},{"$f":"E180-F180","v":6.0694889921861481},null,null,{"$f":"K180-I180","v":1.6980157298673504},{"$f":"I180-J180","v":1.6293088079357965},null,{"$f":"O180-M180","v":0.23449041115956959},{"$f":"M180-N180","v":0.23348965458722404}]
[null,null,null,null,null,{"$f":"G181-E181","v":6.5090849519013148},{"$f":"E181-F181","v":5.6793940836304877},null,null,{"$f":"K181-I181","v":1.6999999999999993},{"$f":"I181-J181","v":1.5999999999999979},null,{"$f":"O181-M181","v":0.20000000000000284},{"$f":"M181-N181","v":0.29999999999999716}]
[null,null,null,null,null,{"$f":"G182-E182","v":6.3000000000000043},{"$f":"E182-F182","v":5.2999999999999972},null,null,{"$f":"K182-I182","v":1.6999999999999993},{"$f":"I182-J182","v":1.6000000000000014},null,{"$f":"O182-M182","v":0.19999999999999574},{"$f":"M182-N182","v":0.30000000000000426}]
[null,null,null,null,null,{"$f":"G183-E183","v":6.1000000000000014},{"$f":"E183-F183","v":5.0999999999999979},null,null,{"$f":"K183-I183","v":1.6999999999999993},{"$f":"I183-J183","v":1.6000000000000014},null,{"$f":"O183-M183","v":0.19999999999999574},{"$f":"M183-N183","v":0.30000000000000426}]
[null,null,null,null,null,{"$f":"G184-E184","v":6.6999999999999957},{"$f":"E184-F184","v":5.6000000000000014},null,null,{"$f":"K184-I184","v":1.6000000000000014},{"$f":"I184-J184","v":1.6000000000000014},null,{"$f":"O184-M184","v":0.20000000000000284},{"$f":"M184-N184","v":0.20000000000000284}]
[null,null,null,null,null,6.6000000000000014,5.4000000000000021,null,null,1.5999999999999979,1.4000000000000021,null,0.20000000000000284,0.19999999999999929]
["Long Term Limiting Illness"]
["Data on 0-4 year olds with long term limiting illness (LTLI) or health conditions which act to affect activities of daily living has been taken from the 2011 census and relates to children aged 0-4 years only. A long-term health problem or disability that limits a person's day-to-day activities, and has lasted, or is expected to last, at least 12 months. "]
["Source: 2011 Census",null,null,null,null,null,null,{"$f":"$D$71","v":"Kingston Buci"},null,{"$f":"$J$71","v":"Stepping Stones"},null,"West Sussex",null,"England"]
["Number of 0-4 year olds with their day-to-day activities limited",null,null,null,null,"No. activities limited a little or a lot",null,{"$f":"HLOOKUP(A196,cfc,DATA!A$1+1,FALSE)","v":22},null,{"$f":"HLOOKUP(A196,cfc,DATA!B$1+1,FALSE)","v":26},null,853,null,70922]
["% of all 0-4 year olds",null,null,null,null,"% activities limited a ot",null,{"$f":"HLOOKUP(A197,cfc,DATA!A$1+1,FALSE)","v":2.4663677130044841E-2},null,{"$f":"HLOOKUP(A197,cfc,DATA!B$1+1,FALSE)","v":3.2338308457711441E-2},null,1.7999999999999999E-2,null,2.1000000000000001E-2]
["FAMILIES",null,null,null,null,null,null,null,null,null,null,null,null,"back to top"]
["Family Composition"]
["Statistical issues",null,"This information is taken from the 2011 Census and provides information on the total number of families within an area with a child aged 0-4, and also the proportion of larger families (of 3 children or more the youngest aged 0-4 in the area)."]
["Source: 2011 Census",null,null,null,null,{"$f":"$D$71","v":"Kingston Buci"},null,{"$f":"$J$71","v":"Stepping Stones"}]
["All Families",null,null,null,null,{"$f":"HLOOKUP(A202,cfc,DATA!A$1+1,FALSE)","v":1701},null,{"$f":"HLOOKUP(A202,cfc,DATA!B$1+1,FALSE)","v":1665},null,null,null,null,{"$f":"F201","v":"Kingston Buci"},{"$f":"H201","v":"Stepping Stones"}]
[" - with one child (aged 0-4)",null,null,null,"One dependent child families 2011 aged 0-4",{"$f":"HLOOKUP(E203,cfc,DATA!A$1+1,FALSE)","v":299},null,{"$f":"HLOOKUP(E203,cfc,DATA!B$1+1,FALSE)","v":256},null,{"$f":"A203","v":" - with one child (aged 0-4)"},null,"one child",{"$f":"F203/F202","v":0.17577895355673134},{"$f":"H203/H202","v":0.15375375375375375}]
["-  with two children (youngest aged 0-4)",null,null,null,"Two dependent children families 2011 youngest aged 0-4",{"$f":"HLOOKUP(E204,cfc,DATA!A$1+1,FALSE)","v":296},null,{"$f":"HLOOKUP(E204,cfc,DATA!B$1+1,FALSE)","v":276},null,{"$f":"A204","v":"-  with two children (youngest aged 0-4)"},null,"two children",{"$f":"F204/F202","v":0.17401528512639625},{"$f":"H204/H202","v":0.16576576576576577}]
["-  with three or more children (youngest aged 0-4)",null,null,null,"Three dependent children families 2011 youngest aged 0-4",{"$f":"HLOOKUP(E205,cfc,DATA!A$1+1,FALSE)","v":106},null,{"$f":"HLOOKUP(E205,cfc,DATA!B$1+1,FALSE)","v":106},null,{"$f":"A205","v":"-  with three or more children (youngest aged 0-4)"},null,"3 or more",{"$f":"F205/F202","v":6.231628453850676E-2},{"$f":"H205/H202","v":6.3663663663663661E-2}]
["% of families with 3 or more children",null,null,null,"families with 3 or more children %",{"$f":"HLOOKUP(E206,cfc,DATA!A$1+1,FALSE)","v":0.10826011162237827},null,{"$f":"HLOOKUP(E206,cfc,DATA!B$1+1,FALSE)","v":0.12492352662605885}]
["Household Composition"]
["Statistical issues",null,"This information is taken from the 2011 Census and provides the total number of households with dependent children and the marital status of the Household Reference person."]
[null,null,null,null,null,null,null,null,null,null,null,{"$f":"F210","v":"Kingston Buci"},{"$f":"H210","v":"Stepping Stones"},"West Sussex","England"]
["Source: 2011 Census",null,null,null,null,{"$f":"$D$71","v":"Kingston Buci"},null,{"$f":"$J$71","v":"Stepping Stones"},null,null,"Couple households",{"$f":"F212","v":1218},{"$f":"H212","v":1069},65639,4482036]
["Households with a 0-4 year old",null,null,null,null,{"$f":"HLOOKUP(A211,cfc,DATA!A$1+1,FALSE)","v":1387},null,{"$f":"HLOOKUP(A211,cfc,DATA!B$1+1,FALSE)","v":1254},null,null,"Non-couple households",{"$f":"F213","v":169},{"$f":"H213","v":185},7309,741155]
[null,"Living in a couple household",null,null,null,{"$f":"HLOOKUP(B212,cfc,DATA!A$1+1,FALSE)","v":1218},null,{"$f":"HLOOKUP(B212,cfc,DATA!B$1+1,FALSE)","v":1069}]
[null,"Not living in a couple household",null,null,null,{"$f":"HLOOKUP(B213,cfc,DATA!A$1+1,FALSE)","v":169},null,{"$f":"HLOOKUP(B213,cfc,DATA!B$1+1,FALSE)","v":185}]
["% in non-couple household",null,null,null,null,{"$f":"HLOOKUP(A214,cfc,DATA!A$1+1,FALSE)","v":0.12184571016582552},null,{"$f":"HLOOKUP(A214,cfc,DATA!B$1+1,FALSE)","v":0.14752791068580542}]
["Census Data on Lone Parent Households"]
["Statistical issues",null,"This relates to all lone parent families not just those with children aged 0-4 years"]
["Source: 2011 Census",null,null,null,null,{"$f":"$D$71","v":"Kingston Buci"},null,{"$f":"$J$71","v":"Stepping Stones"},null,"West Sussex",null,"South East",null,"England"]
["Lone parents (with dependent children) (2011)",null,null,null,null,{"$f":"HLOOKUP(A218,cfc,DATA!A$1+1,FALSE)","v":405},null,{"$f":"HLOOKUP(A218,cfc,DATA!B$1+1,FALSE)","v":384},null,18637,null,215348,null,1564681]
["Lone parents with dependent children - not in employment (2011)",null,null,null,null,{"$f":"HLOOKUP(A219,cfc,DATA!A$1+1,FALSE)","v":156},null,{"$f":"HLOOKUP(A219,cfc,DATA!B$1+1,FALSE)","v":151},null,6279,null,78504,null,634019]
["% not in employment (2011)",null,null,null,null,{"$f":"HLOOKUP(A220,cfc,DATA!A$1+1,FALSE)","v":0.38518518518518519},null,{"$f":"HLOOKUP(A220,cfc,DATA!B$1+1,FALSE)","v":0.39322916666666669},null,0.33700000000000002,null,0.36499999999999999,null,0.40500000000000003]
["Male Lone Parents (2011)",null,null,null,null,{"$f":"HLOOKUP(A221,cfc,DATA!A$1+1,FALSE)","v":30},null,{"$f":"HLOOKUP(A221,cfc,DATA!B$1+1,FALSE)","v":34},null,1695,null,22090,null,151744]
["Lone Parent Families (on Income Support or Income Based Job Seekers Allowance)",null,null,null,null,null,null,null,null,null,null,null,null,null,"back to top"]
["Statistical issues",null,"Working age lone parents claiming benefits. Data from the ONS."]
[null,null,"This is NOT a count of all lone parent families - only those on low incomes - with an income of 60% or below median income. National reasearch (DWP) estimates that approximately half of all lone parent families are living on low incomes."]
["Source: ONS",null,null,null,null,{"$f":"$D$71","v":"Kingston Buci"},null,{"$f":"$J$71","v":"Stepping Stones"},null,null,{"$f":"F225","v":"Kingston Buci"},{"$f":"H225","v":"Stepping Stones"}]
["Lone parent families on low income - 2011",null,null,null,null,{"$f":"HLOOKUP(A226,cfc,DATA!A$1+1,FALSE)","v":135},null,{"$f":"HLOOKUP(A226,cfc,DATA!B$1+1,FALSE)","v":145},null,2011,{"$f":"F226","v":135},{"$f":"H226","v":145}]
["Lone parent families on low income - 2012",null,null,null,null,{"$f":"HLOOKUP(A227,cfc,DATA!A$1+1,FALSE)","v":105},null,{"$f":"HLOOKUP(A227,cfc,DATA!B$1+1,FALSE)","v":130},null,"2012",{"$f":"F227","v":105},{"$f":"H227","v":130}]
["Lone parent families on low income - 2013",null,null,null,null,{"$f":"HLOOKUP(A228,cfc,DATA!A$1+1,FALSE)","v":95},null,{"$f":"HLOOKUP(A228,cfc,DATA!B$1+1,FALSE)","v":105},null,"2013",{"$f":"F228","v":95},{"$f":"H228","v":105}]
["CIRCUMSTANCE",null,null,null,null,null,null,null,null,null,null,null,null,"back to top"]
["Deprivation"]
["Statistical issues",null,"From the Index of Multiple Deprivation 2010. ",null,null,null,null,null,null,null,null,{"$f":"$D$71","v":"Kingston Buci"},null,{"$f":"$J$71","v":"Stepping Stones"}]
[null,null,"CFCs are ranked 1-10 in relation to the rest of the county, the higher the number the lower the deprivation. Areas with deprivation decile less that 3 and under are in the 30% most deprived in West Sussex.",null,null,null,null,null,null,"Local decile",null,{"$f":"HLOOKUP(J232,cfc,DATA!A$1+1,FALSE)","v":3},null,{"$f":"HLOOKUP(J232,cfc,DATA!B$1+1,FALSE)","v":2}]
["Deprivation - Data Collated from the 2011 Census"]
["An update of the DCLG Index of Deprivation is due for publication in mid 2015. This means that the ID2010 s becoming increasingly out of date. More recent data from the 2011 Census has been used to estimate local level deprivation, data are grouped into 4 main issues:-"]
[null,"1. Employment (deprivation identified where any member of a household not a full-time student is either unemployed or long-term sick).\n2. Education (deprivation identified where no person in the household has at least level 2 education, and no person aged 16-18 is a full-time student)\n3. Health and disability (deprivation identified where any person in the household has general health ‘bad or very bad’ or has a long term health problem).\n4. Household overcrowding (deprivation identified when the household accommodation is either overcrowded, with an occupancy rating -1 or less, or is in a shared dwelling, or has no central heating.)"]
[]
[]
["Information is then provided as to the number of households experiencing deprivation on any of all or the issues identified. "]
["This is a measure of general deprivation and relates to all households not just households with dependent children",null,null,null,null,{"$f":"$D$71","v":"Kingston Buci"},null,{"$f":"$J$71","v":"Stepping Stones"},null,"West Sussex",null,"South East",null,"England"]
["Households with 3 or 4 measures of deprivation",null,null,null,null,{"$f":"HLOOKUP(A240,cfc,DATA!A$1+1,FALSE)","v":345},null,{"$f":"HLOOKUP(A240,cfc,DATA!B$1+1,FALSE)","v":300},null,12980,null,143980,null,1249560]
["Deprived households as % of all households in area",null,null,null,null,{"$f":"HLOOKUP(A241,cfc,DATA!A$1+1,FALSE)","v":5.3889409559512651E-2},null,{"$f":"HLOOKUP(A241,cfc,DATA!B$1+1,FALSE)","v":5.3229240596167494E-2},null,3.7999999999999999E-2,null,0.04,null,5.7000000000000002E-2]
["Children Aged 0-4 in Households on Workless Benefits "]
["Why supporting parents into employment is important",null,null,"Unemployment, and notably long term unemployment has long term effects on the individuals and their families. Children in workless households are more likely to live in poverty and have poorer long term outcomes."]
[]
[null,null,null,"This is an Ofsted KPI."]
[" Source: DWP",null,null,null,null,{"$f":"$D$71","v":"Kingston Buci"},null,{"$f":"$J$71","v":"Stepping Stones"},null,null,null,{"$f":"F246","v":"Kingston Buci"},{"$f":"H246","v":"Stepping Stones"}]
["0 to 4 year olds in Out-of-work Benefit Claimant Hholds (2010)",null,null,null,null,{"$f":"HLOOKUP(A247,cfc,DATA!A$1+1,FALSE)","v":165},null,{"$f":"HLOOKUP(A247,cfc,DATA!B$1+1,FALSE)","v":215},null,null,2010,165,215]
["0 to 4 year olds in Out-of-work Benefit Claimant Hholds (2011)",null,null,null,null,{"$f":"HLOOKUP(A248,cfc,DATA!A$1+1,FALSE)","v":165},{"$f":"HLOOKUP(A248,CFCLook,#REF!+3,FALSE)","v":{"$error":"#REF!"}},{"$f":"HLOOKUP(A248,cfc,DATA!B$1+1,FALSE)","v":210},null,null,2011,165,210]
["0 to 4 year olds in Out-of-work Benefit Claimant Hholds (2012)",null,null,null,null,{"$f":"HLOOKUP(A249,cfc,DATA!A$1+1,FALSE)","v":155},{"$f":"HLOOKUP(A249,CFCLook,#REF!+3,FALSE)","v":{"$error":"#REF!"}},{"$f":"HLOOKUP(A249,cfc,DATA!B$1+1,FALSE)","v":215},null,null,2012,155,215]
["0 to 4 year olds in Out-of-work Benefit Claimant Hholds (2013)",null,null,null,null,{"$f":"HLOOKUP(A250,cfc,DATA!A$1+1,FALSE)","v":155},{"$f":"HLOOKUP(A250,CFCLook,#REF!+3,FALSE)","v":{"$error":"#REF!"}},{"$f":"HLOOKUP(A250,cfc,DATA!B$1+1,FALSE)","v":185},null,null,2013,155,185]
["Child Poverty  ",null,null,null,null,null,null,null,null,null,null,null,null,null,"back to top"]
["Why Child Poverty is Important",null,"Children growing up in poverty are more likely to experience a poorer quality of life, both as a child and later as an adult. The impact of poverty includes poor health throughout life, including dying younger than expected; low educational achievement; lower levels of employment and income; living in poorer housing and community environments; long term financial and social exclusion; and can lead to behavioural problems including a high risk lifestyle."]
["Statistical Issues",null,"The information below refers to children aged under 16 and living in households living on income 60% or below median income levels. Note they have been some changes in the sub national child povery measure and so comparions over time should be treated with some caution. CFC, CFC Group and Eduction Partnership data calculated from aggregated LSOA data and so may not sum to West Sussex overall child poverty."]
["For further information on  child poverty in West Sussex refer to the West Sussex Annual Public Health Report 2013: Tackling Child Poverty"]
["Source: HMRC",null,null,null,null,{"$f":"$D$71","v":"Kingston Buci"},null,{"$f":"$J$71","v":"Stepping Stones"},null,"West Sussex",null,"South East",null,"England"]
[null,null,null,null,null,"Number","%","Number","%"]
["% of Children in Poverty 2007",null,null,null,"Number 2007",{"$f":"HLOOKUP(E257,cfc,DATA!A$1+1,FALSE)","v":415},{"$f":"HLOOKUP(A257,cfc,DATA!A$1+1,FALSE)","v":0.16354545454545455},{"$f":"HLOOKUP(E257,cfc,DATA!B$1+1,FALSE)","v":480},{"$f":"HLOOKUP(A257,cfc,DATA!B$1+1,FALSE)","v":0.19444444444444442},{"$f":"DATA!CG$75","v":0.13900000000000001},null,{"$f":"DATA!CG$76","v":0.156},null,{"$f":"DATA!CG$77","v":0.224}]
["% of Children in Poverty 2008",null,null,null,"Number 2008",{"$f":"HLOOKUP(E258,cfc,DATA!A$1+1,FALSE)","v":425},{"$f":"HLOOKUP(A258,cfc,DATA!A$1+1,FALSE)","v":0.15463636363636366},{"$f":"HLOOKUP(E258,cfc,DATA!B$1+1,FALSE)","v":480},{"$f":"HLOOKUP(A258,cfc,DATA!B$1+1,FALSE)","v":0.18844444444444447},{"$f":"DATA!CI$75","v":0.13400000000000001},null,{"$f":"DATA!CI$76","v":0.152},null,{"$f":"DATA!CI$77","v":0.216}]
["% of Children in Poverty 2009",null,null,null,"Number 2009",{"$f":"HLOOKUP(E259,cfc,DATA!A$1+1,FALSE)","v":420},{"$f":"HLOOKUP(A259,cfc,DATA!A$1+1,FALSE)","v":0.15981818181818183},{"$f":"HLOOKUP(E259,cfc,DATA!B$1+1,FALSE)","v":555},{"$f":"HLOOKUP(A259,cfc,DATA!B$1+1,FALSE)","v":0.20177777777777775},{"$f":"DATA!CK$75","v":0.14299999999999999},null,{"$f":"DATA!CK$76","v":0.16},null,{"$f":"DATA!CK$77","v":0.219}]
["% of Children in Poverty 2010",null,null,null,"Number 2010",{"$f":"HLOOKUP(E260,cfc,DATA!A$1+1,FALSE)","v":420},{"$f":"HLOOKUP(A260,cfc,DATA!A$1+1,FALSE)","v":0.1598181818181818},{"$f":"HLOOKUP(E260,cfc,DATA!B$1+1,FALSE)","v":515},{"$f":"HLOOKUP(A260,cfc,DATA!B$1+1,FALSE)","v":0.17744444444444449},{"$f":"DATA!CM$75","v":0.13800000000000001},null,{"$f":"DATA!CM$76","v":0.155},null,{"$f":"DATA!CM$77","v":0.21099999999999999}]
["% of Children in Poverty 2011",null,null,null,"Number 2011",{"$f":"HLOOKUP(E261,cfc,DATA!A$1+1,FALSE)","v":445},{"$f":"HLOOKUP(A261,cfc,DATA!A$1+1,FALSE)","v":0.15672727272727272},{"$f":"HLOOKUP(E261,cfc,DATA!B$1+1,FALSE)","v":520},{"$f":"HLOOKUP(A261,cfc,DATA!B$1+1,FALSE)","v":0.17844444444444446},{"$f":"DATA!CO$75","v":0.13500000000000001},null,{"$f":"DATA!CO$76","v":0.151},null,{"$f":"DATA!CO$77","v":0.20599999999999999}]
["% of Children in Poverty 2012",null,null,null,"Number 2012",{"$f":"HLOOKUP(E262,cfc,DATA!A$1+1,FALSE)","v":435},{"$f":"HLOOKUP(A262,cfc,DATA!A$1+1,FALSE)","v":0.16322701688555347},{"$f":"HLOOKUP(E262,cfc,DATA!B$1+1,FALSE)","v":495},{"$f":"HLOOKUP(A262,cfc,DATA!B$1+1,FALSE)","v":0.19919517102615694},0.124,null,0.14199999999999999,null,0.192]
[]
["BREASTFEEDING - Note this data has not  been updated we are waiting for data from SCT.",null,null,null,null,null,null,null,null,null,null,null,null,"back to top"]
["Why breastfeeding is important",null,"Breastfeeding has benefits for the baby throughout life including protection against obesity, eczma,  diarrhoea and vomiting and other common infections.  It helps mothers lose any excess weight they may have gained during pregnancy, and it reduces the risk of developing breast and ovarian cancer later in life."]
["Rationale for the indicator",null,"The Government recommends exclusive breastfeeding for around 6 months, and then continuing to breastfeed for at least a year or more alongside giving solid foods.  The indicator shows the prevalence of babies being exclusively or partially breastfed at between six and eight weeks old.",null,null,null,null,null,null,null,null,null,"This is an Ofsted KPI."]
["What helps?",null,"All NHS organisations in West Sussex are working towards UNICEF Baby Friendly accreditation.  This is a national kite-mark scheme, with a set of standards for organisations to meet that ensure they provide good support for breastfeeding and appropriate introduction of solids, through training all staff and ensuring a breastfeeding friendly environment.  This will help to make sure families are provided with consistent information about breastfeeding and healthy eating.  "]
["Statistical issues",null,"These data are based on information provided by Health Visitors for the period of April 2012 to March 2013. This is not the same as the national breastfeeding target data which are quarterly. "]
["Information relates to April 2012 to March 2013",null,null,null,null,null,null,null,null,null,null,{"$f":"$D$71","v":"Kingston Buci"},null,{"$f":"$J$71","v":"Stepping Stones"}]
["Percentages are based on the total number of infants not just those with recorded status",null,null,"Number of babies eligible for 6 week check (2012/13)",null,null,null,null,null,null,"Number of babies eligible 2012/13",{"$f":"HLOOKUP(K270,cfc,DATA!A1+1,FALSE)","v":181},null,{"$f":"HLOOKUP(K270,cfc,DATA!B$1+1,FALSE)","v":138}]
[null,null,null,"Number of babies receiving 6 week check (2012/13)",null,null,null,null,null,null,"Number of babies receiving check 2012/13",{"$f":"HLOOKUP(K271,cfc,DATA!A$1+1,FALSE)","v":176},null,{"$f":"HLOOKUP(K271,cfc,DATA!B$1+1,FALSE)","v":123}]
[null,null,null,"% of Eligible Babies Checked (2012/2013)",null,null,null,null,null,null,"% of babies checked 2012/13",{"$f":"HLOOKUP(K272,cfc,DATA!A$1+1,FALSE)","v":0.97242984471245353},null,{"$f":"HLOOKUP(K272,cfc,DATA!B$1+1,FALSE)","v":0.90037632661901679}]
[null,null,null,"Exclusively breastfed (2012/2013)",null,null,null,null,null,null,"Exclusively breastfed 2012/13",{"$f":"HLOOKUP(K273,cfc,DATA!A$1+1,FALSE)","v":73},null,{"$f":"HLOOKUP(K273,cfc,DATA!B$1+1,FALSE)","v":51}]
[null,null,null,"Total including Partially breastfed (2012/2013)",null,null,null,null,null,null,"Total including partially breastfed 2012/13",{"$f":"HLOOKUP(K274,cfc,DATA!A$1+1,FALSE)","v":95},null,{"$f":"HLOOKUP(K274,cfc,DATA!B$1+1,FALSE)","v":71}]
[null,null,null,"% Exclusively breast fed (2012/2013)",null,null,null,null,null,null,"% exclusively breastfed 2012/13",{"$f":"HLOOKUP(K275,cfc,DATA!A$1+1,FALSE)","v":0.42210762312085143},null,{"$f":"HLOOKUP(K275,cfc,DATA!B$1+1,FALSE)","v":0.39368252379312629}]
[null,null,null,"% Breastfeeding (including partially) (2012/2013)",null,null,null,null,null,null,"% breastfeeding (including partially) 2012/13",{"$f":"HLOOKUP(K276,cfc,DATA!A$1+1,FALSE)","v":0.5499432456088803},null,{"$f":"HLOOKUP(K276,cfc,DATA!B$1+1,FALSE)","v":0.56805227360147259}]
["England figures for the same period - Apr 2012-Mar 2013: 32.2% breastfed (exclusively),  47.1% breastfed (including partially)"]
[null,null,{"$f":"L269","v":"Kingston Buci"},{"$f":"N269","v":"Stepping Stones"}]
[null,"% Exclusively breast fed (2012/2013)",{"$f":"(HLOOKUP(K275,cfc,DATA!A$1+1,FALSE))","v":0.42210762312085143},{"$f":"HLOOKUP(K275,cfc,DATA!B$1+1,FALSE)","v":0.39368252379312629},null,null,{"$f":"B279","v":"% Exclusively breast fed (2012/2013)"},{"$f":"B280","v":"ExclusiveLCL"},{"$f":"B281","v":"ExclusiveUCL"},{"$f":"B282","v":"% Breastfeeding (including partially) (2012/2013)"},{"$f":"B283","v":"PartialLCL"},{"$f":"B284","v":"PartialUCL"}]
[null,"ExclusiveLCL",{"$f":"HLOOKUP(B280,cfc,DATA!A1+1,FALSE)","v":0.34456265326077334},{"$f":"HLOOKUP(B280,cfc,DATA!B1+1,FALSE)","v":0.33144299050634901},null,{"$f":"C278","v":"Kingston Buci"},{"$f":"C279","v":0.42210762312085143},{"$f":"G280-C280","v":7.7544969860078083E-2},{"$f":"C281-G280","v":6.6516261104696495E-2},{"$f":"C282","v":0.5499432456088803},{"$f":"J280-C283","v":8.38705430866446E-2},{"$f":"C284-J280","v":6.1830334375267415E-2}]
[null,"ExclusiveUCL",{"$f":"HLOOKUP(B281,cfc,DATA!A1+1,FALSE)","v":0.48862388422554792},{"$f":"HLOOKUP(B281,cfc,DATA!B1+1,FALSE)","v":0.50299618402314283},null,{"$f":"D278","v":"Stepping Stones"},{"$f":"D279","v":0.39368252379312629},{"$f":"G281-D280","v":6.2239533286777282E-2},{"$f":"D281-G281","v":0.10931366023001654},{"$f":"D282","v":0.56805227360147259},{"$f":"J281-D283","v":7.9158324441517436E-2},{"$f":"D284-J281","v":9.2846905045222416E-2}]
[null,"% Breastfeeding (including partially) (2012/2013)",{"$f":"HLOOKUP(K276,cfc,DATA!A1+1,FALSE)","v":0.5499432456088803},{"$f":"HLOOKUP(K276,cfc,DATA!B$1+1,FALSE)","v":0.56805227360147259}]
[null,"PartialLCL",{"$f":"HLOOKUP(B283,cfc,DATA!A1+1,FALSE)","v":0.4660727025222357},{"$f":"HLOOKUP(B283,cfc,DATA!B1+1,FALSE)","v":0.48889394915995515}]
[null,"PartialUCL",{"$f":"HLOOKUP(B284,cfc,DATA!A1+1,FALSE)","v":0.61177357998414772},{"$f":"HLOOKUP(B284,cfc,DATA!B1+1,FALSE)","v":0.66089917864669501}]
["CCG Level and England rates - QUARTERLY DATA  (Financial Year Quarters)",null,null,null,null,null,null,null,null,null,null,null,null,null,"back to top"]
["Since 2008/09, each Primary Care Trust was required to submit quarterly data on the prevalence of breastfeeding at 6-8 weeks.Since 2013/14 this data have been provided at CCG level. This collection reports on the number and proportion of women seen and assessed by a healthcare professional within 12 weeks and 6 days of their maternity, the number and proportion of mothers’ who have initiated or not initiated breastfeeding and the number and proportion of infants who have been fully, partially or not at all breastfed at 6-8 weeks."]
["Statistical issue : Coverage",null,"Areas are required to attain a \"threshold quality\" on coverage; this means that performance data are not published for areas where there are a high number of infants whose breastfeeding status is unknown. The threshold quality has increased since 2008/9:-"]
[null,null,"  -  Between 2008/9 Q1 to 2009/10 Q3 the threshold required was 85%."]
[null,null,"  -  Between 2009/10 Q4 to 2010/11 Q3 the threshold required was 90%."]
[null,null,"  -  From 2010/11 Q4 onwards the threshold required is 95%."]
["Cells shaded red did not meet the coverage threshold % in the quarter. Data for Q1 2014/15 had not been submitted on deadline for West Sussex CCGs.",null,null,null,null,null,null,null,null,null,"Infants totally or partially breastfed as % of all infants due a check"]
[null,null,null,null,null,null,null,null,null,null,"2013/14  Q1","2013/14 Q2","2013/14 Q3","2013/14 Q4","2014/15   Q1"]
["NHS Coastal West Sussex CCG",null,null,null,null,null,null,null,null,null,0.49780509218612817,0.42880523731587561,0.3390894819466248,0.3637236084452975,"n/a"]
["NHS Crawley CCG",null,null,null,null,null,null,null,null,null,0.55844155844155841,0.40454545454545454,0.40825688073394495,0.3832199546485261,"n/a"]
["NHS Horsham and Mid Sussex CCG",null,null,null,null,null,null,null,null,null,0.59130434782608698,0.50701754385964914,0.40063091482649843,0.43016759776536312,"n/a"]
["Surrey And Sussex Area Team",null,null,null,null,null,null,null,null,null,0.59513776337115076,0.56274340112505405,0.56806529245579152,0.57185663247666241,0.54468835750686007]
["England",null,null,null,null,null,null,null,null,null,0.45743165632896854,0.45729092546298339,0.45666947521202467,0.46152359727151515,0.44383044541806066]
["HEALTH",null,null,null,null,null,null,null,null,null,null,null,null,"back to top"]
["Childhood Obesity"]
["Why childhood obesity is important",null,"Overweight and obese children are more likely to become obese adults and have a higher risk of mortality, disability and morbidity in adulthood. Metabolic changes such as raised blood pressure and cholesterol may be seen in obese children and teenagers.  Childhood obesity is linked to psychological problems such as low self-esteem, anxiety and depression which are often seen by children themselves as the most serious effects."]
["Rationale for the indicator",null,"Levels of obesity among reception year and year 6 pupils are rising nationally. This indicator helps Children and Family Centres to monitor local trends and provide appropriate support for families.",null,null,null,null,null,null,null,null,null,"This is an Ofsted KPI."]
["What helps?",null,"Children and family centres can help to reduce obesity by promoting healthy lifestyles, supporting families to modify dietary intake where appropriate, encouraging active play and promoting non-sedentary family activities."]
["Statistical issues",null,"The data are collected through the National Childhood Measurement Programme.  "]
[null,null,"95% confidence intervals are shown, where confidence intervals overlap, it is not possible to say that a difference is statistically significant. A statement is provided in the tables to state whether centres/areas have rates significantly different to England. Results at centre and cluster level have wide confidence intervals because of small numbers."]
[null,null,"It should be noted that the National Child Measurement Programme remains voluntary. In 2011/12 80% of all reception class pupils in West Sussex were measured and 90.5% of Year 6 pupils. Across England 92.4% of reception class pupils and 92.4% of Year 6 pupils were measured."]
[null,null,"The data included in these profiles relate to where pupils live, not school location. "]
["Tables, which detail the number of children measured are provided for both Reception and Year 6 pupils, are provided on the following pages."]
[]
[null,"Reception",{"$f":"$D$71","v":"Kingston Buci"},{"$f":"$J$71","v":"Stepping Stones"},"West Sussex","England"]
[null,"2009/10",{"$f":"H332","v":4.6875E-2},{"$f":"J332","v":4.7058823529411764E-2},{"$f":"L332","v":7.8E-2},{"$f":"N332","v":9.8000000000000004E-2}]
[null,"UCL",{"$f":"I333-H332","v":5.1622522450943217E-2},{"$f":"K333-J332","v":6.7778448033775918E-2},{"$f":"M333-L332","v":7.0000000000000062E-3},{"$f":"O333-N332","v":1.0000000000000009E-3}]
[null,"LCL",{"$f":"H332-H333","v":2.5217155828076224E-2},{"$f":"J332-J333","v":2.8608562696341055E-2},{"$f":"L332-L333","v":6.0000000000000053E-3},{"$f":"N332-N333","v":1.0000000000000009E-3}]
[null,"2010/11",{"$f":"H338","v":5.7692307692307696E-2},{"$f":"J338","v":0.05},{"$f":"L338","v":0.08},{"$f":"N338","v":9.4E-2}]
[null,"UCL",{"$f":"I339-H338","v":4.8306466415456148E-2},{"$f":"D313-J339","v":2.6885635585534206E-2},{"$f":"M339-L338","v":5.9999999999999915E-3},{"$f":"O339-N338","v":1.0000000000000009E-3}]
[null,"LCL",{"$f":"H338-H339","v":2.704656552851218E-2},{"$f":"J338-J339","v":2.6885635585534206E-2},{"$f":"L338-L339","v":6.0000000000000053E-3},{"$f":"N338-N339","v":1.0000000000000009E-3}]
[null,"2011/12",{"$f":"H344","v":6.8181818181818177E-2},{"$f":"J344","v":0.14130434782608695},{"$f":"L344","v":7.7897495631916128E-2},{"$f":"N344","v":9.5000000000000001E-2}]
[null,"UCL",{"$f":"I345-H344","v":5.632224465307753E-2},{"$f":"D316-J345","v":5.6827414042257954E-2},{"$f":"M345-L344","v":6.0000000000000053E-3},{"$f":"O345-N344","v":1.0000000000000009E-3}]
[null,"LCL",{"$f":"H344-H345","v":3.1899483327006609E-2},{"$f":"J344-J345","v":5.6827414042257954E-2},{"$f":"L344-L345","v":6.0000000000000053E-3},{"$f":"N344-N345","v":1.0000000000000009E-3}]
[null,"2012/13",{"$f":"H350","v":0.10303030303030303},{"$f":"J350","v":9.6491228070175433E-2},{"$f":"L350","v":7.7897495631916128E-2},{"$f":"N350","v":9.5000000000000001E-2}]
[null,"UCL",{"$f":"I351-H350","v":5.5767108722317854E-2},{"$f":"K351-J350","v":6.8062667995254844E-2},{"$f":"M351-L350","v":6.0000000000000053E-3},{"$f":"O351-N350","v":1.0000000000000009E-3}]
[null,"LCL",{"$f":"H350-H351","v":3.7703503318481935E-2},{"$f":"J350-J351","v":4.175507902496163E-2},{"$f":"L350-L351","v":6.0000000000000053E-3},{"$f":"N350-N351","v":1.0000000000000009E-3}]
[]
[]
[]
[]
[]
[]
["HEALTHY WEIGHT - DATA FOR CHILDREN IN RECEPTION CLASS 2009/10 to 2012/13 - West Sussex data in this profile based on home postcode of pupils."]
["RECEPTION CLASS PUPILS 2009/10",null,null,null,null,null,null,{"$f":"$D$71","v":"Kingston Buci"},null,{"$f":"$J$71","v":"Stepping Stones"},null,"West Sussex",null,"England"]
["2009/10 - Measured (Reception)",null,null,null,null,null,null,{"$f":"HLOOKUP(A330,cfc,DATA!A1+1,FALSE)","v":128},null,{"$f":"HLOOKUP(A330,cfc,DATA!$B$1+1,FALSE)","v":85},null,6842,null,526499]
["2009/10 - Measured as Obese (Reception)",null,null,null,"% Underweight",null,null,{"$f":"HLOOKUP(A331,cfc,DATA!A1+1,FALSE)","v":6},null,{"$f":"HLOOKUP(A331,cfc,DATA!$B$1+1,FALSE)","v":4},null,534,null,51733]
["% Obese (Reception) - 2009/10",null,null,null,"% Healthy Weight",null,null,{"$f":"HLOOKUP(A332,cfc,DATA!A1+1,FALSE)","v":4.6875E-2},null,{"$f":"HLOOKUP(A332,cfc,DATA!$B$1+1,FALSE)","v":4.7058823529411764E-2},null,7.8E-2,null,9.8000000000000004E-2]
["2009/10 (Reception) - 95% Confidence Limits",null,null,null,null,"2009/10 (Reception) - LCL","2009/10 (Reception) - UCL",{"$f":"HLOOKUP(F333,cfc,DATA!A1+1,FALSE)","v":2.1657844171923776E-2},{"$f":"HLOOKUP(G333,cfc,DATA!A1+1,FALSE)","v":9.8497522450943217E-2},{"$f":"HLOOKUP(F333,cfc,DATA!$B$1+1,FALSE)","v":1.8450260833070709E-2},{"$f":"HLOOKUP(G333,cfc,DATA!$B$1+1,FALSE)","v":0.11483727156318768},7.1999999999999995E-2,8.5000000000000006E-2,9.7000000000000003E-2,9.9000000000000005E-2]
["2009/10 Significance (Reception)",null,null,null,null,null,null,{"$f":"HLOOKUP(A334,cfc,DATA!A1+1,FALSE)","v":"No Sig diff"},null,{"$f":"HLOOKUP(A334,cfc,DATA!B1+1,FALSE)","v":"No Sig diff"},null,"Sig better than Eng."]
["RECEPTION CLASS PUPILS 2010/11",null,null,null,null,null,null,{"$f":"$D$71","v":"Kingston Buci"},null,{"$f":"$J$71","v":"Stepping Stones"},null,"West Sussex",null,"England"]
["2010/11 - Measured (Reception)",null,null,null,null,null,null,{"$f":"HLOOKUP(A336,cfc,DATA!$A$1+1,FALSE)","v":156},null,{"$f":"HLOOKUP(A336,cfc,DATA!$B$1+1,FALSE)","v":120},null,7605,null,541255]
["2010/11 - Measured as Obese (Reception)",null,null,null,"% Underweight",null,null,{"$f":"HLOOKUP(A337,cfc,DATA!$A$1+1,FALSE)","v":9},null,{"$f":"HLOOKUP(A337,cfc,DATA!$B$1+1,FALSE)","v":6},null,605,null,51071]
["% Obese (Reception) - 2010/11",null,null,null,"% Healthy Weight",null,null,{"$f":"HLOOKUP(A338,cfc,DATA!$A$1+1,FALSE)","v":5.7692307692307696E-2},null,{"$f":"HLOOKUP(A338,cfc,DATA!$B$1+1,FALSE)","v":0.05},null,0.08,null,9.4E-2]
["2010/11 (Reception) - 95% Confidence Limits",null,null,null,null,"2010/11 (Reception) - LCL","2010/11 (Reception) - UCL",{"$f":"HLOOKUP(F339,cfc,DATA!$A$1+1,FALSE)","v":3.0645742163795515E-2},{"$f":"HLOOKUP(G339,cfc,DATA!$A$1+1,FALSE)","v":0.10599877410776384},{"$f":"HLOOKUP(F339,cfc,DATA!$B$1+1,FALSE)","v":2.3114364414465797E-2},{"$f":"HLOOKUP(G339,cfc,DATA!$B$1+1,FALSE)","v":0.10480288536236734},7.3999999999999996E-2,8.5999999999999993E-2,9.2999999999999999E-2,9.5000000000000001E-2]
["2010/11 Significance (Reception)",null,null,null,null,null,null,{"$f":"HLOOKUP(A340,cfc,DATA!$A$1+1,FALSE)","v":"No Sig diff"},null,{"$f":"HLOOKUP(A340,cfc,DATA!$B$1+1,FALSE)","v":"No Sig diff"},null,"Sig better than Eng."]
["RECEPTION CLASS PUPILS 2011/12",null,null,null,null,null,null,{"$f":"$D$71","v":"Kingston Buci"},null,{"$f":"$J$71","v":"Stepping Stones"},null,"West Sussex",null,"England"]
["2011/12 - Measured (Reception)",null,null,null,null,null,null,{"$f":"HLOOKUP(A342,cfc,DATA!A1+1,FALSE)","v":132},null,{"$f":"HLOOKUP(A342,cfc,DATA!$B$1+1,FALSE)","v":92},null,6868,null,565662]
["2011/12 - Measured as Obese (Reception)",null,null,null,"% Underweight",null,null,{"$f":"HLOOKUP(A343,cfc,DATA!A1+1,FALSE)","v":9},null,{"$f":"HLOOKUP(A343,cfc,DATA!$B$1+1,FALSE)","v":13},null,{"$f":"L342*L344","v":535},null,53669]
["% Obese (Reception) - 2011/12",null,null,null,"% Healthy Weight",null,null,{"$f":"HLOOKUP(A344,cfc,DATA!A1+1,FALSE)","v":6.8181818181818177E-2},null,{"$f":"HLOOKUP(A344,cfc,DATA!$B$1+1,FALSE)","v":0.14130434782608695},null,7.7897495631916128E-2,null,9.5000000000000001E-2]
["2011/12 (Reception) - 95% Confidence Limits",null,null,null,null,"2011/12 (Reception) - LCL","2011/12 (Reception) - UCL",{"$f":"HLOOKUP(F345,cfc,DATA!A1+1,FALSE)","v":3.6282334854811568E-2},{"$f":"HLOOKUP(G345,cfc,DATA!A1+1,FALSE)","v":0.12450406283489571},{"$f":"HLOOKUP(F345,cfc,DATA!$B$1+1,FALSE)","v":8.4476933783828992E-2},{"$f":"HLOOKUP(G345,cfc,DATA!$B$1+1,FALSE)","v":0.22688580200803002},{"$f":"L344-0.006","v":7.1897495631916122E-2},{"$f":"L344+0.006","v":8.3897495631916133E-2},9.4E-2,9.6000000000000002E-2]
["2011/12 Significance (Reception)",null,null,null,null,null,null,{"$f":"HLOOKUP(A346,cfc,DATA!A1+1,FALSE)","v":"No Sig diff"},null,{"$f":"HLOOKUP(A346,cfc,DATA!B1+1,FALSE)","v":"No Sig diff"},null,"Sig better than Eng."]
["RECEPTION CLASS PUPILS 2012/13",null,null,null,null,null,null,{"$f":"$D$71","v":"Kingston Buci"},null,{"$f":"$J$71","v":"Stepping Stones"},null,"West Sussex",null,"England"]
["2012/13 - Measured (Reception)",null,null,null,null,null,null,{"$f":"HLOOKUP(A348,cfc,DATA!A1+1,FALSE)","v":165},null,{"$f":"HLOOKUP(A348,cfc,DATA!$B$1+1,FALSE)","v":114},null,6868,null,565662]
["2012/13 - Measured as Obese (Reception)",null,null,null,"% Underweight",null,null,{"$f":"HLOOKUP(A349,cfc,DATA!A1+1,FALSE)","v":17},null,{"$f":"HLOOKUP(A349,cfc,DATA!$B$1+1,FALSE)","v":11},null,{"$f":"L348*L350","v":535},null,53669]
["% Obese (Reception) - 2012/13",null,null,null,"% Healthy Weight",null,null,{"$f":"HLOOKUP(A350,cfc,DATA!A1+1,FALSE)","v":0.10303030303030303},null,{"$f":"HLOOKUP(A350,cfc,DATA!$B$1+1,FALSE)","v":9.6491228070175433E-2},null,7.7897495631916128E-2,null,9.5000000000000001E-2]
["2012/13 (Reception) - 95% Confidence Limits",null,null,null,null,"2012/13 (Reception) - LCL","2012/13 (Reception) - UCL",{"$f":"HLOOKUP(F351,cfc,DATA!A1+1,FALSE)","v":6.5326799711821093E-2},{"$f":"HLOOKUP(G351,cfc,DATA!A1+1,FALSE)","v":0.15879741175262088},{"$f":"HLOOKUP(F351,cfc,DATA!$B$1+1,FALSE)","v":5.4736149045213803E-2},{"$f":"HLOOKUP(G351,cfc,DATA!$B$1+1,FALSE)","v":0.16455389606543028},{"$f":"L350-0.006","v":7.1897495631916122E-2},{"$f":"L350+0.006","v":8.3897495631916133E-2},9.4E-2,9.6000000000000002E-2]
["2012/13 Significance (Reception)",null,null,null,null,null,null,{"$f":"HLOOKUP(A352,cfc,DATA!A1+1,FALSE)","v":"No Sig diff"},null,{"$f":"HLOOKUP(A352,cfc,DATA!B1+1,FALSE)","v":"No Sig diff"},null,"Sig better than Eng."]
["HEALTHY WEIGHT - DATA FOR CHILDREN IN YEAR 6 2009/10 to 2012/13 - West Sussex data in this profile based on home postcode of pupils."]
["YEAR 6 PUPILS 2009/10",null,null,null,null,null,null,{"$f":"$D$71","v":"Kingston Buci"},null,{"$f":"$J$71","v":"Stepping Stones"},null,"West Sussex",null,"England"]
["2009/10 - Measured (Year 6)",null,null,null,null,null,null,{"$f":"HLOOKUP(A355,cfc,DATA!$A$1+1,FALSE)","v":135},null,{"$f":"HLOOKUP(A355,cfc,DATA!$B$1+1,FALSE)","v":103},null,6911,null,499867]
["2009/10 - Measured as Obese (Year 6)",null,null,null,null,null,null,{"$f":"HLOOKUP(A356,cfc,DATA!$A$1+1,FALSE)","v":25},null,{"$f":"HLOOKUP(A356,cfc,DATA!$B$1+1,FALSE)","v":19},null,1099,null,93649]
["% Obese (Year 6) - 2009/10",null,null,null,null,null,null,{"$f":"HLOOKUP(A357,cfc,DATA!$A$1+1,FALSE)","v":0.18518518518518517},null,{"$f":"HLOOKUP(A357,cfc,DATA!$B$1+1,FALSE)","v":0.18446601941747573},null,0.159,null,0.187]
["2009/10 (Year 6) - 95% Confidence Limits",null,null,null,null,"2009/10 (Year 6) - LCL","2009/10 (Year 6) - UCL",{"$f":"HLOOKUP(F358,cfc,DATA!$A$1+1,FALSE)","v":0.12869783265528051},{"$f":"HLOOKUP(G358,cfc,DATA!$A$1+1,FALSE)","v":0.25909310009649444},{"$f":"HLOOKUP(F358,cfc,DATA!$B$1+1,FALSE)","v":0.12139537223023854},{"$f":"HLOOKUP(G358,cfc,DATA!$B$1+1,FALSE)","v":0.27022656257424815},0.151,0.16800000000000001,0.186,0.188]
["2009/10 Significance (Year 6)",null,null,null,null,null,null,{"$f":"HLOOKUP(A359,cfc,DATA!$A$1+1,FALSE)","v":"No Sig diff"},null,{"$f":"HLOOKUP(A359,cfc,DATA!$B$1+1,FALSE)","v":"No Sig diff"},null,"Sig better than Eng."]
["YEAR 6 PUPILS 2010/11",null,null,null,null,null,null,{"$f":"$D$71","v":"Kingston Buci"},null,{"$f":"$J$71","v":"Stepping Stones"},null,"West Sussex",null,"England"]
["2010/11 - Measured (Year 6)",null,null,null,null,null,null,{"$f":"HLOOKUP(A361,cfc,DATA!$A$1+1,FALSE)","v":120},null,{"$f":"HLOOKUP(A361,cfc,DATA!$B$1+1,FALSE)","v":94},null,6998,null,495353]
["2010/11 - Measured as Obese (Year 6)",null,null,null,null,null,null,{"$f":"HLOOKUP(A362,cfc,DATA!$A$1+1,FALSE)","v":27},null,{"$f":"HLOOKUP(A362,cfc,DATA!$B$1+1,FALSE)","v":19},null,1110,null,94315]
["% Obese (Year 6) - 2010/11",null,null,null,null,null,null,{"$f":"HLOOKUP(A363,cfc,DATA!$A$1+1,FALSE)","v":0.22500000000000001},null,{"$f":"HLOOKUP(A363,cfc,DATA!$B$1+1,FALSE)","v":0.20212765957446807},null,0.159,null,0.19]
["2010/11 (Year 6) - 95% Confidence Limits",null,null,null,null,"2010/11 (Year 6) - LCL","2010/11 (Year 6) - UCL",{"$f":"HLOOKUP(F364,cfc,DATA!$A$1+1,FALSE)","v":0.15949154668383531},{"$f":"HLOOKUP(G364,cfc,DATA!$A$1+1,FALSE)","v":0.30756899484645162},{"$f":"HLOOKUP(F364,cfc,DATA!$B$1+1,FALSE)","v":0.1333948198921881},{"$f":"HLOOKUP(G364,cfc,DATA!$B$1+1,FALSE)","v":0.29425067236660452},0.15,0.16800000000000001,0.189,0.191]
["2010/11 Significance (Year 6)",null,null,null,null,null,null,{"$f":"HLOOKUP(A365,cfc,DATA!$A$1+1,FALSE)","v":"No Sig diff"},null,{"$f":"HLOOKUP(A365,cfc,DATA!$B$1+1,FALSE)","v":"No Sig diff"},null,"Sig better than Eng."]
["YEAR 6 PUPILS 2011/12 ",null,null,null,null,null,null,{"$f":"$D$71","v":"Kingston Buci"},null,{"$f":"$J$71","v":"Stepping Stones"},null,"West Sussex",null,"England"]
["2011/12 - Measured (Year 6)",null,null,null,null,null,null,{"$f":"HLOOKUP(A367,cfc,DATA!$A$1+1,FALSE)","v":121},null,{"$f":"HLOOKUP(A367,cfc,DATA!$B$1+1,FALSE)","v":97},null,6940,null,491118]
["2011/12 - Measured as Obese (Year 6)",null,null,null,null,null,null,{"$f":"HLOOKUP(A368,cfc,DATA!$A$1+1,FALSE)","v":18},null,{"$f":"HLOOKUP(A368,cfc,DATA!$B$1+1,FALSE)","v":18},null,{"$f":"L367*L369","v":1080},null,94307]
["% Obese (Year 6) - 2011/2012",null,null,null,"% Healthy Weight",null,null,{"$f":"HLOOKUP(A369,cfc,DATA!$A$1+1,FALSE)","v":0.1487603305785124},null,{"$f":"HLOOKUP(A369,cfc,DATA!$B$1+1,FALSE)","v":0.18556701030927836},null,0.15561959654178675,null,0.192]
["2011/12 (Year 6) - 95% Confidence Limits",null,null,null,null,"2011/12 (Year 6) - LCL","2011/12 (Year 6) - UCL",{"$f":"HLOOKUP(F370,cfc,DATA!$A$1+1,FALSE)","v":9.6217408704644847E-2},{"$f":"HLOOKUP(G370,cfc,DATA!$A$1+1,FALSE)","v":0.22291903200226135},{"$f":"HLOOKUP(F370,cfc,DATA!$B$1+1,FALSE)","v":0.12072903379332831},{"$f":"HLOOKUP(G370,cfc,DATA!$B$1+1,FALSE)","v":0.27436103418690677},{"$f":"L369-0.009","v":0.14661959654178675},{"$f":"L369+0.009","v":0.16461959654178676},0.191,0.193]
["2011/12 Significance (Year 6)",null,null,null,null,null,null,{"$f":"HLOOKUP(A371,cfc,DATA!$A$1+1,FALSE)","v":"No Sig diff"},null,{"$f":"HLOOKUP(A371,cfc,DATA!$B$1+1,FALSE)","v":"No Sig diff"},null,"Sig better than Eng."]
["YEAR 6 PUPILS 2012/13 ",null,null,null,null,null,null,{"$f":"$D$71","v":"Kingston Buci"},null,{"$f":"$J$71","v":"Stepping Stones"},null,"West Sussex",null,"England"]
["2012/13 - Measured (Year 6)",null,null,null,null,null,null,{"$f":"HLOOKUP(A373,cfc,DATA!$A$1+1,FALSE)","v":125},null,{"$f":"HLOOKUP(A373,cfc,DATA!$B$1+1,FALSE)","v":90},null,6940,null,491118]
["2012/13 - Measured as Obese (Year 6)",null,null,null,null,null,null,{"$f":"HLOOKUP(A374,cfc,DATA!$A$1+1,FALSE)","v":27},null,{"$f":"HLOOKUP(A374,cfc,DATA!$B$1+1,FALSE)","v":19},null,{"$f":"L373*L375","v":1080},null,94307]
["% Obese (Year 6) - 2012/2013",null,null,null,"% Healthy Weight",null,null,{"$f":"HLOOKUP(A375,cfc,DATA!$A$1+1,FALSE)","v":0.216},null,{"$f":"HLOOKUP(A375,cfc,DATA!$B$1+1,FALSE)","v":0.21111111111111111},null,0.15561959654178675,null,0.192]
["2012/13 (Year 6) - 95% Confidence Limits",null,null,null,null,"2012/13 (Year 6) - LCL","2012/13 (Year 6) - UCL",{"$f":"HLOOKUP(F376,cfc,DATA!$A$1+1,FALSE)","v":0.15290810140879452},{"$f":"HLOOKUP(G376,cfc,DATA!$A$1+1,FALSE)","v":0.2960270422175349},{"$f":"HLOOKUP(F376,cfc,DATA!$B$1+1,FALSE)","v":0.13952592118014923},{"$f":"HLOOKUP(G376,cfc,DATA!$B$1+1,FALSE)","v":0.30634799581257288},{"$f":"L375-0.009","v":0.14661959654178675},{"$f":"L375+0.009","v":0.16461959654178676},0.191,0.193]
["2012/13 Significance (Year 6)",null,null,null,null,null,null,{"$f":"HLOOKUP(A377,cfc,DATA!$A$1+1,FALSE)","v":"No Sig diff"},null,{"$f":"HLOOKUP(A377,cfc,DATA!$B$1+1,FALSE)","v":"No Sig diff"},null,"Sig better than Eng."]
["IMPROVING THE ORAL HEALTH OF CHILDREN",null,null,null,null,null,null,null,null,null,null,null,null,null,"back to top"]
["Why oral health is important",null,"Poor oral health in children is caused by poor diet, poor oral hygiene and lack of exposure to fluoride.  Children from socially disadvantaged groups experience disproportionately high levels of oral health problems."]
["Indicators",null,"• Numbers of decayed, missing or filled teeth (DoH)"]
[null,null,"• Year on year improvements in numbers of child patients seen by NHS dentists (DH)",null,null,null,null,null,null,null,null,null,"tbc"]
[null,null,"• Sales of toothbrushes and toothpaste in the community shops remain constant or improve",null,null,null,null,null,null,null,null,null,"tbc"]
[null,null,"• All relevant staff are trained in the West Sussex Oral Health Toolkit",null,null,null,null,null,null,null,null,null,"tbc"]
["Decayed, Missing or Filled Teeth"]
["Rationale for the indicator",null,"The most recent dental survey - with national comparators - for children aged 12 was undertaken in 2011/12.  A sample of children in each LA in England examined and number of decayed, missing or filled teeth (DMFT) assessed.  The survey provides an indication of oral health in West Sussex."]
["What helps?",null,"Children and family centres can support families to develop good oral hygiene from birth by promoting regular tooth-brushing, encouraging visits to the dentist, and advising parents to reduce sweets, sugary snacks and fizzy drinks.  Centres should proactively support families living in deprived areas because children living in those areas are more likely to have poor oral health."]
["Statistical issues",null,"In the national survey only a small number of children were sampled in Adur, Chichester and Mid Sussex so results are not robust in those areas."]
["Mean D3MFT (% D3MFT > 0)",null,null,"For those children with decay experience, the average number of obviously Decayed, Missing (due to decay) and Filled Teeth per child."]
["UCL / LCL",null,null,"UCL = Upper Confidence Limit",null,null,null,null,"UCL = Lower Confidence Limit"]
[null,null,null,"95% confidence intervals are shown and should used making comparisons; where confidence intervals overlap, it is not possible to say that a difference is statistically significant. Siginificance relates to whether an area has a significantly higher or lower percentage of children with dental decay than England average."]
[null,null,null,null,"% of children examined with dental decay",null,null,null,null,"Of those with decay average number of teeth per child"]
[null,null,null,null,"% D3MFT > 0",null,null,"LCL","UCL"," Mean D3MFT (% D3MFT > 0)",null,null,null,"LCL","UCL"]
[null,null,"Adur",null,0.1939579562856745,null,null,5.8033183958424217E-2,0.32988272861292478,4.03,null,null,null,1.7899999999999999E-2,6.2700000000000006E-2]
[null,null,"Arun",null,0.22800000000000001,null,null,0.09,0.36599999999999999,2.86,null,null,null,1.15E-2,4.5699999999999998E-2]
["In Worthing the number of children examined was too small (<30) for a robust sample",null,"Chichester",null,8.4000000000000005E-2,null,null,1.2E-2,0.156,3.23,null,null,null,1.7100000000000001E-2,4.7399999999999998E-2]
[null,null,"Crawley",null,0.17699999999999999,null,null,7.5999999999999998E-2,0.27900000000000003,2.36,null,null,null,1.21E-2,3.5000000000000003E-2]
[null,null,"Horsham",null,8.1000000000000003E-2,null,null,1.2999999999999999E-2,0.14799999999999999,1.9,null,null,null,9.7000000000000003E-3,2.8400000000000002E-2]
[null,null,"Mid Sussex",null,6.9000000000000006E-2,null,null,0,0.14399999999999999,2,null,null,null,4.0000000000000002E-4,3.9600000000000003E-2]
[null,null,"Worthing"]
[null,null,"England",null,0.27900000000000003,null,null,0.27700000000000002,0.28100000000000003,3.38,null,null,null,3.3599999999999998E-2,3.4099999999999998E-2]
["A note on Dental Decay in 3yr olds\nThe Oral Health survey of three-year-old children, carried out during the 2012-13 school year measured the dental decay by visually examining for missing teeth, filled teeth and teeth with obvious decay. The sampling method was primarily through local authorities, creating a sample of children from a range of different childcare institutions. However the dental examination required parental consent, and the samples collected finally represented 8% of the population of that age group. At a national level 12% of the children surveyed had obvious decay; however this figure varied across regions. In West Sussex the number of children surveyed was less than 1% and the data collected was from Arun, Chichester and Worthing only. The eventual figure for West Sussex of 3.5% of children with early childhood caries is relatively low. However the very small size of the data collected for West Sussex was not comprehensive enough to give a truly accurate figure of the prevalence of dental decay in children under 3."]
[]
[]
["IMPROVING CHILDREN'S EMOTIONAL HEALTH AND WELL BEING AND ADULT MENTAL HEALTH"]
["Why emotional wellbeing is important",null,"Strong bonding and attachment between parent or carer and infant supports the development of empathy, trust and wellbeing in the child, and builds resilience to adverse life events or circumstances. The mental health of adults can have a direct impact on the emotional health and wellbeing of children and young people in their care."]
["What helps?",null,"Children and family centres can play an important role in supporting parents and carers with mental health problems with their family and parenting responsibilities.  Newly developed perinatal mental health pathways will support appropriate referral to services.  CFCs can also provide a non-stigmatising venue for counselling and other services."]
["Indicators",null,"• Effectiveness of child and adolescent mental health (CAMHS)",null,null,null,null,null,null,null,null,null,"Not included in this profile"]
[null,null,"• Percentage of children who achieve a total of at least 78 points across the Early Years Foundation Stage (EYFSP) with at least 6 points scored in each of the personal, social and emotional development (PSED) and communication, language and literacy (CLL) scales. ",null,null,null,null,null,null,null,null,null,"Ofsted KPI"]
[null,null,"• Numbers of people within a resource pool area accessing Solihull training (WSCC)",null,null,null,null,null,null,null,null,null,"Not included in this profile"]
[null,null,"• 85% of mothers to be screened post-natally for post-natal depression (DH)"]
["Rationale for the indicators",null,"Personal, social and emotional development, along with speech, language and communication are strong measures of developing empathy and resilience in children.  Low scores for either would indicate those children more likely to require intensive support.  All new mothers should be assessed by doctors, midwives and health visitors for PND.  Mothers who agree to a 12-16 visit from their health visitor are systematically assessed so that services can respond appropriately to local levels of need. West Sussex is using the Solihull approach to promote positive parenting skills, supporting both parent or carer and child."]
["POST NATAL DEPRESSION",null,null,null,null,null,null,null,null,null,null,null,null,null,"back to top"]
["Why this  is important",null,"Post Natal Depression is a distressing condition that can affect a mother's ability to care for her baby and herself.  It is common, affecting about 1 in 10 mothers.  A small number develop psychotic symptoms and need to seek help urgently. Most women will get better within 3-6 months without treatment but 1 in 4 will still be affected when the baby is a year old.  PND can spoil a mother's enjoyment of the new baby, put a strain on the relationship with her partner, and can affect the child's long term development and behaviour even after the depression has ended."]
["What helps?",null,"Children and family centres can encourage mothers to access social support from their families or other mothers, and by helping them to balance caring for a new baby with other aspects of their lives.  They can help mothers who seek advice to access appropriate support through their health visitor or GP. "]
["Statistical issues",null,"In compiling the information relating to Post Natal Depression a number of issues were identified:-"]
[null,null," - The data relate only to those women who have agreed to a 12-16 week visit and therefore not all mothers are included in the figures"]
[null,null," - The number of babies eligible for a 12-16 week check and data from checks conducted are stored on different systems, linked by baby’s date of birth. "]
[null,null," - Mother’s may answer ‘yes’ to the ‘Woolley’ questionnaire by may refuse to take the EPDS questionnaire"]
[null,null," -  the figures shown overleaf relate to the calendar year 2011. No firther data have been provided to update this indicator."]
["POST NATAL DEPRESSION (PND)"]
["The diagram below shows how women are currently being screened and identified for support via the 3 month check. The figures in blue represent the number of women at each stage of the process. Of the 5,104 women with recorded information, 5,048 had been screened using the Woolley questionnaire. The data showed that various paths had been followed with the screening tools, some women had no initial screening data but then had been assessed using the Edinburgh scale, some had identified using the Woolley but then not assessed using the Edinburgh tool."]
["The data reflect the fact that the process by which women are identified as having, or being at risk of having, post natal depression is inconsistent across West Sussex. The information below relates to 5,100 women, this is compared to approximately 9,000 births."]
["The diagram below shows that,of the women where the Woolley tool was used, 273 women requested more help."]
[]
[]
[]
["INCREASING  UPTAKE OF SMOKING CESSATION SERVICES: MATERNAL SMOKING NOTE: Awaiting data from SCT",null,null,null,null,null,null,null,null,null,null,null,null,null,"back to top"]
["Why maternal smoking is important",null,"Exposure to second hand smoke among children and young people is associated with Sudden Infant Death Syndrome (SIDS), respiratory and ear problems.  Unborn children exposed to maternal smoking are at risk of low birth weight and preterm delivery.  Babies born to mothers who smoke have a higher risk of infant mortality."]
["Rationale for the indicator",null,"Smoking status among new mothers is collected at the 12-16 week check by health visitors."]
["What helps?",null,"Children and family centres target the most disadvantaged communities, who are also more likely to smoke.  They offer an ideal setting for parents to access NHS smoking cessation advice and support."]
["Statistical issues",null,"This data relates to the calendar year 2012. No data have been provided to update this indicator."]
[null,null,"The data were collected as part of the 12-16 week check. Information provided relating to smoking at the time of booking and smoking at the time of delivery was therefore collected retrospectively."]
[null,null,"We have only included \"yes\" / \"no\" responses; non responses or \"don't knows\" have been excluded from the calculations, this means that the total number of responses to each of the questions is different; i.e. 4,950 responses to Question 1 compared to  4,949 responses to Question 2."]
["Question 1 : Smoking at the TIME OF BOOKING",null,null,null,null,null,null,"Question 2 : Smoking at the TIME OF DELIVERY"]
["At the time of booking 550 women (11.1%) of the 4,950 who provided information said that they smoked. ",null,null,null,null,null,null,"At the time of delivery 431 women (8.7%) of the 4,949 who provided information said that they smoked. "]
[]
["Question 3 : Smoking at the the HEALTH VISITOR 12 WEEK CHECK",null,null,null,null,null,null,"Question 4 : SMOKING IN THE HOME"]
["At the time of their 12-16 week check  532 women (10.8%) of the 4,941 who provided information said that they smoked.",null,null,null,null,null,null,"Mothers were asked whether anyone (including themselves) smoked at home, 22.4% (1,103 of 4,922 who answered the question) said there was someone at home who smoked."]
[]
[null,null,null,null,null,{"$f":"D71","v":"Kingston Buci"},{"$f":"J71","v":"Stepping Stones"},"West Sussex",null,null,{"$f":"F440","v":"Kingston Buci"},"Stepping Stones","West Sussex"]
[null,null,null,"% Book","% smoking at time of booking",{"$f":"HLOOKUP(E441,cfc,DATA!A$1+1,FALSE)","v":7.4494949494949489E-2},{"$f":"HLOOKUP(E441,cfc,DATA!A$1+2,FALSE)","v":0.15052910052910054},{"$f":"DATA!GB75","v":0.1111111111111111},null,"% Smoking at the Time of BOOKING",{"$f":"F441","v":7.4494949494949489E-2},{"$f":"G441","v":0.15052910052910054},0.1111111111111111]
[null,null,null,"LCLbook",null,{"$f":"HLOOKUP(D442,cfc,DATA!A$1+1,FALSE)","v":4.283011146065737E-2},{"$f":"HLOOKUP(D442,cfc,DATA!B$1+1,FALSE)","v":5.315354431925607E-2},{"$f":"DATA!GC75","v":0.10265589099194035},null,"UCL",{"$f":"F443-F441","v":8.14057286150731E-2},{"$f":"G443-G441","v":5.548622978558565E-2},{"$f":"H443-H441","v":9.0583704320736091E-3}]
[null,null,null,"UCLbook",null,{"$f":"HLOOKUP(D443,cfc,DATA!A$1+1,FALSE)","v":0.15590067811002259},{"$f":"HLOOKUP(D443,cfc,DATA!B$1+1,FALSE)","v":0.20601533031468619},{"$f":"DATA!GD75","v":0.12016948154318471},null,"LCL",{"$f":"F441-F442","v":3.1664838034292118E-2},{"$f":"G441-G442","v":9.7375556209844477E-2},{"$f":"H441-H442","v":8.455220119170756E-3}]
[null,null,null,"% Deliver","%smoking at delivery",{"$f":"HLOOKUP(E444,cfc,DATA!A$1+1,FALSE)","v":5.8712121212121209E-2},{"$f":"HLOOKUP(E444,cfc,DATA!B$1+1,FALSE)","v":0.15661375661375662},{"$f":"DATA!GF75","v":8.7088300666801371E-2},null,"% Smoking at the Time of DELIVERY",{"$f":"F444","v":5.8712121212121209E-2},{"$f":"G444","v":0.15661375661375662},{"$f":"H444","v":8.7088300666801371E-2}]
[null,null,null,"LCLdel",null,{"$f":"HLOOKUP(D445,cfc,DATA!A$1+1,FALSE)","v":2.8956279687604513E-2},{"$f":"HLOOKUP(D445,cfc,DATA!B$1+1,FALSE)","v":4.2994504137461961E-2},{"$f":"DATA!GG75","v":7.9549266554230474E-2},null,"UCL",{"$f":"F446-F444","v":7.0998928149488216E-2},{"$f":"G446-G444","v":3.0508412887976316E-2},{"$f":"H446-H444","v":8.1795720955172707E-3}]
[null,null,null,"UCLdel",null,{"$f":"HLOOKUP(D446,cfc,DATA!A$1+1,FALSE)","v":0.12971104936160943},{"$f":"HLOOKUP(D446,cfc,DATA!B$1+1,FALSE)","v":0.18712216950173294},{"$f":"DATA!GH75","v":9.5267872762318642E-2},null,"LCL",{"$f":"F444-F445","v":2.9755841524516696E-2},{"$f":"G444-G445","v":0.11361925247629466},{"$f":"H444-H445","v":7.5390341125708971E-3}]
[null,null,null,"% Current","%current smoker",{"$f":"HLOOKUP(E447,cfc,DATA!A$1+1,FALSE)","v":6.8813131313131312E-2},{"$f":"HLOOKUP(E447,cfc,DATA!B$1+1,FALSE)","v":0.18994708994708998},{"$f":"DATA!GJ75","v":0.10767051204209674},null,"% Smoking at the Time of the 12-16 WEEK CHECK",{"$f":"F447","v":6.8813131313131312E-2},{"$f":"G447","v":0.18994708994708998},{"$f":"H447","v":0.10767051204209674}]
[null,null,null,"LCLsmoke",null,{"$f":"HLOOKUP(D448,cfc,DATA!A$1+1,FALSE)","v":3.5767126237989492E-2},{"$f":"HLOOKUP(D448,cfc,DATA!B$1+1,FALSE)","v":7.459006187684232E-2},{"$f":"DATA!GK75","v":9.9330388823194393E-2},null,null,{"$f":"F449-F447","v":7.4118801758826139E-2},{"$f":"G449-G447","v":5.273612479950468E-2},{"$f":"H449-H447","v":8.9497172495540539E-3}]
[null,null,null,"UCLsmoke",null,{"$f":"HLOOKUP(D449,cfc,DATA!A$1+1,FALSE)","v":0.14293193307195745},{"$f":"HLOOKUP(D449,cfc,DATA!B$1+1,FALSE)","v":0.24268321474659466},{"$f":"DATA!GL75","v":0.11662022929165079},null,null,{"$f":"F447-F448","v":3.304600507514182E-2},{"$f":"G447-G448","v":0.11535702807024766},{"$f":"H447-H448","v":8.3401232189023455E-3}]
[null,null,null,"% House","%Smoker in household",{"$f":"HLOOKUP(E450,cfc,DATA!A$1+1,FALSE)","v":0.20391414141414141},{"$f":"HLOOKUP(E450,cfc,DATA!B$1+1,FALSE)","v":0.21177248677248675},{"$f":"DATA!GN75","v":0.22409589597724502},null,"% stating SMOKER IN THE HOUSEHOLD",{"$f":"F450","v":0.20391414141414141},{"$f":"G450","v":0.21177248677248675},{"$f":"H450","v":0.22409589597724502}]
[null,null,null,"LCLhouse",null,{"$f":"HLOOKUP(D451,cfc,DATA!A$1+1,FALSE)","v":0.14776236248775229},{"$f":"HLOOKUP(D451,cfc,DATA!B$1+1,FALSE)","v":0.17018055060319134},{"$f":"DATA!GO75","v":0.21266415369596228},null,null,{"$f":"F452-F450","v":0.10746677905831528},{"$f":"G452-G450","v":0.16773784720573778},{"$f":"H452-H450","v":1.1862090348510046E-2}]
[null,null,null,"UCLhouse",null,{"$f":"HLOOKUP(D452,cfc,DATA!A$1+1,FALSE)","v":0.31138092047245669},{"$f":"HLOOKUP(D452,cfc,DATA!B$1+1,FALSE)","v":0.37951033397822453},{"$f":"DATA!GP75","v":0.23595798632575507},null,null,{"$f":"F450-F451","v":5.6151778926389118E-2},{"$f":"G450-G451","v":4.1591936169295407E-2},{"$f":"H450-H451","v":1.1431742281282742E-2}]
["MEDICAL",null,null,null,null,null,null,null,null,null,null,null,null,"back to top"]
["IMPROVING COVERAGE FOR ALL CHILDHOOD IMMUNISATIONS"]
["Why childhood immunisations are important",null,"Immunisations are an extremely effective way of protecting children against infectious diseases including diphtheria, tetanus, whooping cough, polio, meningitis, pneumonia, measles, rubella and mumps.  Good coverage makes outbreaks of infectious disease less likely to happen.  There will always be some children who cannot be immunised for medical or other reasons and high coverage in the rest of the population helps to protect them."]
["Indicators",null,"To achieve a 95% coverage rates across all childhood immunisations (DH)"]
["Rationale for the indicator",null,"The indicator helps children and family centres to identify groups of children who may have lower coverage and provide them with appropriate advice and information."]
["What helps?",null,"Children and family centres should work with their local Immunisation co-ordinator to ensure all staff are up to date with training and are confident in providing appropriate advice. They can provide information to parents and provide a setting for some of the immunisation programme to be delivered thereby improving access."]
["Statistical issues",null,"Immunisation coverage comparison data (against West Sussex and England published rates) rely on treatment centre level data and this includes \"in and out\" of area children (i.e. children resident in other counties). Data here only relate to West Sussex resident children; with a West Sussex GP or not registered with a GP."]
[null,null,"This information is based on the home postcode of children, children have been mapped to their CFC catchment area."]
[null,null,"Data relate to Q1 2013/14 and each cohort relates to children who had their 1st, 2nd, 5th birthday within the quarter."]
["Vaccine Abbreviations",null,"5-in-1 (DTaP/IPV/Hib) ",null,null,"Diphtheria / Tetanus / Acellular Pertussis / Polio / Haemophilus Influenza type B also known as the 5 in 1. Vaccine offered at 2,3 and 4 months"]
[null,null,"Men C",null,null,"First vaccinations is given to babies at between three and four months old and a third dose is given at 12 months. The third dose is combined with the Hib vaccine (Hib/MenC booster). "]
[null,null,"Pneumo jab ",null,null,"Vaccination provided to protect against streptococcus pneumoniae,and provided at 2 and 4 months. "]
[null,null,"MMR",null,null,"MMR is the combined vaccine (measles, mumps and rubella). Children vaccinated usually within a month of the first birthday and a booster befoire starting school (between 3 and 5)."]
[null,null,"Hib/Men C booster",null,null,"Vaccine against Haemophilus influenzae type b (Hib) / meningitis C (MenC). Given at between 12-13 months "]
[null,null,"Pre-School Booster",null,null,"Booster for diphtheria, tetanus, pertussis (whooping cough) and polio.\n3 years and 4 months of age or shortly thereafter."]
["The data overleaf is separated into age cohorts. Immunisation for children aged 1, 2 and 5. For each cohort their immunisation for all immunisations is shown, this means that for the Age 5 Cohort the vaccine coverage of these children at 1 and 2 is also shown "]
[]
["IMPROVING COVERAGE FOR ALL CHILDHOOD IMMUNISATIONS (Data only provided at CFC and CFC Group Level)"]
["AGE 1 COHORT (Children had their 1st  birthday within the quarter).",null,null,null,null,null,null,{"$f":"$D$71","v":"Kingston Buci"},null,null,null,{"$f":"$J$71","v":"Stepping Stones"},null,{"$f":"$J$71","v":"Stepping Stones"}]
["Immunisations Total age1 eligible Q1 2013-14",null,null,"Imms - Eligible Children (1 year olds)",null,null,null,{"$f":"HLOOKUP($A472,cfc,DATA!A$1+1,FALSE)","v":57},null,null,null,{"$f":"HLOOKUP($A472,cfc,DATA!B$1+1,FALSE)","v":36}]
["3rd 5 in 1 vaccination (at 4 months)",null,null,"age1 3rd5in1","Vaccinated   ",null,null,{"$f":"HLOOKUP(D473,cfc,DATA!A1+1,FALSE)","v":53},null,null,null,{"$f":"HLOOKUP($D473,cfc,DATA!$B$1+1,FALSE)","v":33}]
[null,null,null,"age1 3rd5in1%","% Vaccinated",null,null,{"$f":"IF(H472=\"*\",\"*\",H473/H472)","v":0.92982456140350878},null,null,null,{"$f":"IF(L472=\"*\",\"*\",L473/L472)","v":0.91666666666666663}]
[null,null,null,null,"Coverage vs. 95%",null,null,{"$f":"IF(H474=\"*\",\"*\",IF(H474<0.95,\"Lower than required coverage\",IF(H474>=0.95,\"Required overage or above\")))","v":"Lower than required coverage"},null,null,null,{"$f":"IF(L474=\"*\",\"*\",IF(L474<0.95,\"Lower than required coverage\",IF(L474>=0.95,\"Required overage or above\")))","v":"Lower than required coverage"}]
["2nd Men C (at 4 months)",null,null,"age1 2nd MenC","Vaccinated   ",null,null,{"$f":"HLOOKUP($D476,cfc,DATA!$A$1+1,FALSE)","v":52},null,null,null,{"$f":"HLOOKUP($D476,cfc,DATA!$B$1+1,FALSE)","v":33}]
[null,null,null,"age1 2nd MenC%","% Vaccinated",null,null,{"$f":"IF(H472=\"*\",\"*\",H476/H$472)","v":0.91228070175438591},null,null,null,{"$f":"IF(L472=\"*\",\"*\",L476/L472)","v":0.91666666666666663}]
[null,null,null,null,"Coverage vs. 95%",null,null,{"$f":"IF(H477=\"*\",\"*\",IF(H477<0.95,\"Lower than required coverage\",IF(H477>=0.95,\"Required overage or above\")))","v":"Lower than required coverage"},null,null,null,{"$f":"IF(L477=\"*\",\"*\",IF(L477<0.95,\"Lower than required coverage\",IF(L477>=0.95,\"Required overage or above\")))","v":"Lower than required coverage"}]
["1st Pneumococcal (2 months)",null,null,"age1 1st Pneu","Vaccinated   ",null,null,{"$f":"HLOOKUP($D479,cfc,DATA!$A$1+1,FALSE)","v":55},null,null,null,{"$f":"HLOOKUP($D479,cfc,DATA!$B$1+1,FALSE)","v":33}]
[null,null,null,"age1 1st Pneu%","% Vaccinated",null,null,{"$f":"IF(H475=\"*\",\"*\",H479/H$472)","v":0.96491228070175439},null,null,null,{"$f":"IF(L472=\"*\",\"*\",L479/L$472)","v":0.91666666666666663}]
[null,null,null,null,"Coverage vs. 95%",null,null,{"$f":"IF(H480=\"*\",\"*\",IF(H480<0.95,\"Lower than required coverage\",IF(H480>=0.95,\"Required overage or above\")))","v":"Required overage or above"},null,null,null,{"$f":"IF(L480=\"*\",\"*\",IF(L480<0.95,\"Lower than required coverage\",IF(L480>=0.95,\"Required overage or above\")))","v":"Lower than required coverage"}]
["2nd Pneumococcal (4 months)",null,null,"age1 2nd Pneu","Vaccinated   ",null,null,{"$f":"HLOOKUP($D482,cfc,DATA!$A$1+1,FALSE)","v":53},null,null,null,{"$f":"HLOOKUP($D482,cfc,DATA!$B$1+1,FALSE)","v":33}]
[null,null,null,"age1 2nd Pneu%","% Vaccinated",null,null,{"$f":"IF(H478=\"*\",\"*\",H482/H$472)","v":0.92982456140350878},null,null,null,{"$f":"IF(L472=\"*\",\"*\",L482/L$472)","v":0.91666666666666663}]
[null,null,null,null,"Coverage vs. 95%",null,null,{"$f":"IF(H483=\"*\",\"*\",IF(H483<0.95,\"Lower than required coverage\",IF(H483>=0.95,\"Required overage or above\")))","v":"Lower than required coverage"},null,null,null,{"$f":"IF(L483=\"*\",\"*\",IF(L483<0.95,\"Lower than required coverage\",IF(L483>=0.95,\"Required overage or above\")))","v":"Lower than required coverage"}]
["AGE 2 COHORT (Children had their 2nd  birthday within the quarter).",null,null,null,null,null,null,{"$f":"$D$71","v":"Kingston Buci"},null,null,null,{"$f":"$J$71","v":"Stepping Stones"},null,{"$f":"$J$71","v":"Stepping Stones"}]
["total age2 eligible",null,null,"Imms - Eligible Children (2 year olds)",null,null,null,{"$f":"HLOOKUP($A486,cfc,DATA!$A$1+1,FALSE)","v":42},null,null,null,{"$f":"HLOOKUP($A486,cfc,DATA!$B$1+1,FALSE)","v":24}]
["3rd 5 in 1 vaccination (at 4 months)",null,null,"age2 3rd5in1","Vaccinated   ",null,null,{"$f":"HLOOKUP($D487,cfc,DATA!$A$1+1,FALSE)","v":41},null,null,null,{"$f":"HLOOKUP($D487,cfc,DATA!$B$1+1,FALSE)","v":24}]
[null,null,null,"age2 3rd5in1%","% Vaccinated",null,null,{"$f":"IF(H486=\"*\",\"*\",H487/H486)","v":0.97619047619047616},null,null,null,{"$f":"IF(L486=\"*\",\"*\",L487/L486)","v":1}]
[null,null,null,null,"Coverage vs. 95%",null,null,{"$f":"IF(H488=\"*\",\"*\",IF(H488<0.95,\"Lower than required coverage\",IF(H488>=0.95,\"Required overage or above\")))","v":"Required overage or above"},null,null,null,{"$f":"IF(L488=\"*\",\"*\",IF(L488<0.95,\"Lower than required coverage\",IF(L488>=0.95,\"Required overage or above\")))","v":"Required overage or above"}]
["2nd Men C (at 4 months)",null,null,"age2 2ndMenC","Vaccinated   ",null,null,{"$f":"HLOOKUP($D490,cfc,DATA!$A$1+1,FALSE)","v":41},null,null,null,{"$f":"HLOOKUP($D490,cfc,DATA!$B$1+1,FALSE)","v":24}]
[null,null,null,"age2 2ndMenC%","% Vaccinated",null,null,{"$f":"IF(H486=\"*\",\"*\",H490/H486)","v":0.97619047619047616},null,null,null,{"$f":"IF(L486=\"*\",\"*\",L490/L486)","v":1}]
[null,null,null,null,"Coverage vs. 95%",null,null,{"$f":"IF(H491=\"*\",\"*\",IF(H491<0.95,\"Lower than required coverage\",IF(H491>=0.95,\"Required overage or above\")))","v":"Required overage or above"},null,null,null,{"$f":"IF(L491=\"*\",\"*\",IF(L491<0.95,\"Lower than required coverage\",IF(L491>=0.95,\"Required overage or above\")))","v":"Required overage or above"}]
["1st Pneumococcal (2 months)",null,null,"age2 1stPneu","Vaccinated   ",null,null,{"$f":"HLOOKUP($D493,cfc,DATA!$A$1+1,FALSE)","v":41},null,null,null,{"$f":"HLOOKUP($D493,cfc,DATA!$B$1+1,FALSE)","v":24}]
[null,null,null,"age2 1stPneu%","% Vaccinated",null,null,{"$f":"IF(H486=\"*\",\"*\",H493/H486)","v":0.97619047619047616},null,null,null,{"$f":"IF(L486=\"*\",\"*\",L493/L486)","v":1}]
[null,null,null,null,"Coverage vs. 95%",null,null,{"$f":"IF(H494=\"*\",\"*\",IF(H494<0.95,\"Lower than required coverage\",IF(H494>=0.95,\"Required overage or above\")))","v":"Required overage or above"},null,null,null,{"$f":"IF(L494=\"*\",\"*\",IF(L494<0.95,\"Lower than required coverage\",IF(L494>=0.95,\"Required overage or above\")))","v":"Required overage or above"}]
["2nd Pneumococcal (4 months)",null,null,"age2 2ndPneu","Vaccinated   ",null,null,{"$f":"HLOOKUP($D496,cfc,DATA!$A$1+1,FALSE)","v":41},null,null,null,{"$f":"HLOOKUP($D496,cfc,DATA!$B$1+1,FALSE)","v":24}]
[null,null,null,"age2 2ndPneu%","% Vaccinated",null,null,{"$f":"IF(H486=\"*\",\"*\",H496/H486)","v":0.97619047619047616},null,null,null,{"$f":"IF(L486=\"*\",\"*\",L496/L486)","v":1}]
[null,null,null,null,"Coverage vs. 95%",null,null,{"$f":"IF(H497=\"*\",\"*\",IF(H497<0.95,\"Lower than required coverage\",IF(H497>=0.95,\"Required overage or above\")))","v":"Required overage or above"},null,null,null,{"$f":"IF(L497=\"*\",\"*\",IF(L497<0.95,\"Lower than required coverage\",IF(L497>=0.95,\"Required overage or above\")))","v":"Required overage or above"}]
["3rd Pneumococcal (12 - 13 months - within 1 month of 1st birthday) ",null,null,"age2 PneuBoost","Vaccinated   ",null,null,{"$f":"HLOOKUP($D499,cfc,DATA!$A$1+1,FALSE)","v":40},null,null,null,{"$f":"HLOOKUP($D499,cfc,DATA!$B$1+1,FALSE)","v":22}]
[null,null,null,null,"% Vaccinated",null,null,{"$f":"IF(H486=\"*\",\"*\",H499/H486)","v":0.95238095238095233},null,null,null,{"$f":"IF(L486=\"*\",\"*\",L499/L486)","v":0.91666666666666663}]
[null,null,null,null,"Coverage vs. 95%",null,null,{"$f":"IF(H500=\"*\",\"*\",IF(H500<0.95,\"Lower than required coverage\",IF(H500>=0.95,\"Required overage or above\")))","v":"Required overage or above"},null,null,null,{"$f":"IF(L500=\"*\",\"*\",IF(L500<0.95,\"Lower than required coverage\",IF(L500>=0.95,\"Required overage or above\")))","v":"Lower than required coverage"}]
["Hib/Men C booster (12-13 months- within 1 month of 1st birthday)",null,null,"age2 HibMenCBoost","Vaccinated   ",null,null,{"$f":"HLOOKUP($D502,cfc,DATA!$A$1+1,FALSE)","v":40},null,null,null,{"$f":"HLOOKUP($D502,cfc,DATA!$B$1+1,FALSE)","v":24}]
[null,null,null,null,"% Vaccinated",null,null,{"$f":"IF(H486=\"*\",\"*\",H502/H486)","v":0.95238095238095233},null,null,null,{"$f":"IF(L486=\"*\",\"*\",L502/L486)","v":1}]
[null,null,null,null,"Coverage vs. 95%",null,null,{"$f":"IF(H503=\"*\",\"*\",IF(H503<0.95,\"Lower than required coverage\",IF(H503>=0.95,\"Required overage or above\")))","v":"Required overage or above"},null,null,null,{"$f":"IF(L503=\"*\",\"*\",IF(L503<0.95,\"Lower than required coverage\",IF(L503>=0.95,\"Required overage or above\")))","v":"Required overage or above"}]
["1st MMR (12-13 months- within 1 month of 1st birthday)",null,null,"age2 MMR1","Vaccinated   ",null,null,{"$f":"HLOOKUP($D505,cfc,DATA!$A$1+1,FALSE)","v":40},null,null,null,{"$f":"HLOOKUP($D505,cfc,DATA!$B$1+1,FALSE)","v":22}]
[null,null,null,null,"% Vaccinated",null,null,{"$f":"IF(H486=\"*\",\"*\",H505/H486)","v":0.95238095238095233},null,null,null,{"$f":"IF(L486=\"*\",\"*\",L505/L486)","v":0.91666666666666663}]
[null,null,null,null,"Coverage vs. 95%",null,null,{"$f":"IF(H506=\"*\",\"*\",IF(H506<0.95,\"Lower than required coverage\",IF(H506>=0.95,\"Required overage or above\")))","v":"Required overage or above"},null,null,null,{"$f":"IF(L506=\"*\",\"*\",IF(L506<0.95,\"Lower than required coverage\",IF(L506>=0.95,\"Required overage or above\")))","v":"Lower than required coverage"}]
["IMPROVING COVERAGE FOR ALL CHILDHOOD IMMUNISATIONS"]
["AGE 5 COHORT (Children had their 5th birthday within the quarter).",null,null,null,null,null,null,{"$f":"$D$71","v":"Kingston Buci"},null,null,null,{"$f":"$J$71","v":"Stepping Stones"},null,{"$f":"$J$71","v":"Stepping Stones"}]
["Total age5 eligible",null,null,"Imms - Eligible Children",null,null,null,{"$f":"HLOOKUP($A510,cfc,DATA!$A$1+1,FALSE)","v":41},null,null,null,{"$f":"HLOOKUP($A510,cfc,DATA!$B$1+1,FALSE)","v":30}]
["3rd 5 in 1 vaccination (at 4 months)",null,null,"age5 3rd5in1","Vaccinated   ",null,null,{"$f":"HLOOKUP($D511,cfc,DATA!$A$1+1,FALSE)","v":38},null,null,null,{"$f":"HLOOKUP($D511,cfc,DATA!$B$1+1,FALSE)","v":30}]
[null,null,null,null,"% Vaccinated",null,null,{"$f":"IF(H510=\"*\",\"*\",H511/H510)","v":0.92682926829268297},null,null,null,{"$f":"IF(L510=\"*\",\"*\",L511/L510)","v":1}]
[null,null,null,null,"Coverage vs. 95%",null,null,{"$f":"IF(H512=\"*\",\"*\",IF(H512<0.95,\"Lower than required coverage\",IF(H512>=0.95,\"Required overage or above\")))","v":"Lower than required coverage"},null,null,null,{"$f":"IF(L512=\"*\",\"*\",IF(L512<0.95,\"Lower than required coverage\",IF(L512>=0.95,\"Required overage or above\")))","v":"Required overage or above"}]
["2nd Men C (at 4 months)",null,null,"age5 2ndMenC","Vaccinated   ",null,null,{"$f":"HLOOKUP($D514,cfc,DATA!$A$1+1,FALSE)","v":37},null,null,null,{"$f":"HLOOKUP($D514,cfc,DATA!$B$1+1,FALSE)","v":30}]
[null,null,null,null,"% Vaccinated",null,null,{"$f":"IF(H510=\"*\",\"*\",H514/H510)","v":0.90243902439024393},null,null,null,{"$f":"IF(L510=\"*\",\"*\",L514/L510)","v":1}]
[null,null,null,null,"Coverage vs. 95%",null,null,{"$f":"IF(H515=\"*\",\"*\",IF(H515<0.95,\"Lower than required coverage\",IF(H515>=0.95,\"Required overage or above\")))","v":"Lower than required coverage"},null,null,null,{"$f":"IF(L515=\"*\",\"*\",IF(L515<0.95,\"Lower than required coverage\",IF(L515>=0.95,\"Required overage or above\")))","v":"Required overage or above"}]
["1st Pneumococcal (2 months)",null,null,"age5 1stPneu","Vaccinated   ",null,null,{"$f":"HLOOKUP($D517,cfc,DATA!$A$1+1,FALSE)","v":38},null,null,null,{"$f":"HLOOKUP($D517,cfc,DATA!$B$1+1,FALSE)","v":30}]
[null,null,null,null,"% Vaccinated",null,null,{"$f":"IF(H510=\"*\",\"*\",H517/H510)","v":0.92682926829268297},null,null,null,{"$f":"IF(L510=\"*\",\"*\",L517/L510)","v":1}]
[null,null,null,null,"Coverage vs. 95%",null,null,{"$f":"IF(H518=\"*\",\"*\",IF(H518<0.95,\"Lower than required coverage\",IF(H518>=0.95,\"Required overage or above\")))","v":"Lower than required coverage"},null,null,null,{"$f":"IF(L518=\"*\",\"*\",IF(L518<0.95,\"Lower than required coverage\",IF(L518>=0.95,\"Required overage or above\")))","v":"Required overage or above"}]
["2nd Pneumococcal (4 months)",null,null,"age5 2ndPneu","Vaccinated   ",null,null,{"$f":"HLOOKUP($D520,cfc,DATA!$A$1+1,FALSE)","v":37},null,null,null,{"$f":"HLOOKUP($D520,cfc,DATA!$B$1+1,FALSE)","v":30}]
[null,null,null,null,"% Vaccinated",null,null,{"$f":"IF(H510=\"*\",\"*\",H520/H510)","v":0.90243902439024393},null,null,null,{"$f":"IF(L510=\"*\",\"*\",L520/L510)","v":1}]
[null,null,null,null,"Coverage vs. 95%",null,null,{"$f":"IF(H521=\"*\",\"*\",IF(H521<0.95,\"Lower than required coverage\",IF(H521>=0.95,\"Required overage or above\")))","v":"Lower than required coverage"},null,null,null,{"$f":"IF(L521=\"*\",\"*\",IF(L521<0.95,\"Lower than required coverage\",IF(L521>=0.95,\"Required overage or above\")))","v":"Required overage or above"}]
["3rd Pneumococcal (12 - 13 months - within 1 month of 1st birthday) ",null,null,"age5 PneuBoost","Vaccinated   ",null,null,{"$f":"HLOOKUP($D523,cfc,DATA!$A$1+1,FALSE)","v":37},null,null,null,{"$f":"HLOOKUP($D523,cfc,DATA!$B$1+1,FALSE)","v":27}]
[null,null,null,null,"% Vaccinated",null,null,{"$f":"IF(H523=\"*\",\"*\",H523/H510)","v":0.90243902439024393},null,null,null,{"$f":"IF(L523=\"*\",\"*\",L523/L510)","v":0.9}]
[null,null,null,null,"Coverage vs. 95%",null,null,{"$f":"IF(H524=\"*\",\"*\",IF(H524<0.95,\"Lower than required coverage\",IF(H524>=0.95,\"Required overage or above\")))","v":"Lower than required coverage"},null,null,null,{"$f":"IF(L524=\"*\",\"*\",IF(L524<0.95,\"Lower than required coverage\",IF(L524>=0.95,\"Required overage or above\")))","v":"Lower than required coverage"}]
["Hib/Men C booster (12-13 months- within 1 month of 1st birthday)",null,null,"age5 HibMenCBoost","Vaccinated   ",null,null,{"$f":"HLOOKUP($D526,cfc,DATA!$A$1+1,FALSE)","v":38},null,null,null,{"$f":"HLOOKUP($D526,cfc,DATA!$B$1+1,FALSE)","v":29}]
[null,null,null,null,"% Vaccinated",null,null,{"$f":"IF(H510=\"*\",\"*\",H526/H510)","v":0.92682926829268297},null,null,null,{"$f":"IF(L510=\"*\",\"*\",L526/L510)","v":0.96666666666666667}]
[null,null,null,null,"Coverage vs. 95%",null,null,{"$f":"IF(H527=\"*\",\"*\",IF(H527<0.95,\"Lower than required coverage\",IF(H527>=0.95,\"Required overage or above\")))","v":"Lower than required coverage"},null,null,null,{"$f":"IF(L527=\"*\",\"*\",IF(L527<0.95,\"Lower than required coverage\",IF(L527>=0.95,\"Required overage or above\")))","v":"Required overage or above"}]
["1st MMR (12-13 months- within 1 month of 1st birthday)",null,null,"age5 MMR1","Vaccinated   ",null,null,{"$f":"HLOOKUP($D529,cfc,DATA!$A$1+1,FALSE)","v":37},null,null,null,{"$f":"HLOOKUP($D529,cfc,DATA!$B$1+1,FALSE)","v":29}]
[null,null,null,null,"% Vaccinated",null,null,{"$f":"IF(H510=\"*\",\"*\",H529/H510)","v":0.90243902439024393},null,null,null,{"$f":"IF(L510=\"*\",\"*\",L529/L510)","v":0.96666666666666667}]
[null,null,null,null,"Coverage vs. 95%",null,null,{"$f":"IF(H530=\"*\",\"*\",IF(H530<0.95,\"Lower than required coverage\",IF(H530>=0.95,\"Required overage or above\")))","v":"Lower than required coverage"},null,null,null,{"$f":"IF(L530=\"*\",\"*\",IF(L530<0.95,\"Lower than required coverage\",IF(L530>=0.95,\"Required overage or above\")))","v":"Required overage or above"}]
["Pre-School Booster (3yrs 4mths – 5 yrs)",null,null,"age5 PSB","Vaccinated   ",null,null,{"$f":"HLOOKUP($D532,cfc,DATA!$A$1+1,FALSE)","v":36},null,null,null,{"$f":"HLOOKUP($D532,cfc,DATA!$B$1+1,FALSE)","v":27}]
[null,null,null,null,"% Vaccinated",null,null,{"$f":"IF(H510=\"*\",\"*\",H532/H510)","v":0.87804878048780488},null,null,null,{"$f":"IF(L510=\"*\",\"*\",L532/L510)","v":0.9}]
[null,null,null,null,"Coverage vs. 95%",null,null,{"$f":"IF(H533=\"*\",\"*\",IF(H533<0.95,\"Lower than required coverage\",IF(H533>=0.95,\"Required overage or above\")))","v":"Lower than required coverage"},null,null,null,{"$f":"IF(L533=\"*\",\"*\",IF(L533<0.95,\"Lower than required coverage\",IF(L533>=0.95,\"Required overage or above\")))","v":"Lower than required coverage"}]
["2nd MMR (3yrs 4mths – 5 yrs)",null,null,"age5 MMR2","Vaccinated   ",null,null,{"$f":"HLOOKUP($D535,cfc,DATA!$A$1+1,FALSE)","v":36},null,null,null,{"$f":"HLOOKUP($D535,cfc,DATA!$B$1+1,FALSE)","v":27}]
[null,null,null,null,"% Vaccinated",null,null,{"$f":"IF(H510=\"*\",\"*\",H535/H510)","v":0.87804878048780488},null,null,null,{"$f":"IF(L510=\"*\",\"*\",L535/L510)","v":0.9}]
[null,null,null,null,"Coverage vs. 95%",null,null,{"$f":"IF(H536=\"*\",\"*\",IF(H536<0.95,\"Lower than required coverage\",IF(H536>=0.95,\"Required overage or above\")))","v":"Lower than required coverage"},null,null,null,{"$f":"IF(L536=\"*\",\"*\",IF(L536<0.95,\"Lower than required coverage\",IF(L536>=0.95,\"Required overage or above\")))","v":"Lower than required coverage"}]
[" *  ","Vaccination coverage data are already provided to GP practices and CCGs on the basis of GP registered populations."]
["Hospital Admissions "]
["What is being measured?",null,"Hospital admissions due to injury of children aged 5 and under 2010/11 to 2012/13.",null,null,null,null,null,null,null,null,null,"This is an Ofsted KPI."]
["Why is it being measured?",null,"Injuries are a leading cause of hospitalisation and represent a major cause of premature mortality for children and young people. They are also a source of long-term health issues, including mental health related to experience(s). "]
["How is the indicator defined?",null,"Hospital admissions caused by unintentional and deliberate injuries in children (aged 0-4 years) Crude rate per 1,000 0-4 year olds"]
["How accurate and complete is the data? ",null,"HES inpatient data and ONS population statistics are generally considered to be complete and robust. However, there may be a question regarding the quality of external cause coding."]
["Are there any other caveats/ problems/ weaknesses?",null,"There may be differences in admission thresholds."]
[null,null,"There may be variation between Trusts in the way hospital admissions are coded. There may be variation in data recording completeness. Injury information could potentially be missing in the admission episode record but added instead to a subsequent episode record."]
[null,null,"The Injury Profiles indicator is based on finished admissions, whereas the Child Profiles indicator is based on episodes. The Injury Profiles indicator is based on emergency admissions only, whereas the Child Profiles indicator includes all admission methods."]
["Emergency Admissions",null,null,null,null,null,null,null,null,null,null,null,null,null,"back to top"]
["Source: HES and ONS                                      ",null,"Number of Admissions","Resident Population",null,"Rate per 10,000",null,"Lower 95% CI",null,"Upper 95% CI",null,"England Average Rate",null,"Significance  Compared to England"]
["Adur",null,59,3701,null,159.41637395298599,null,121.355131313716,null,205.63550781192501,null,134.69999999999999,null,"No difference"]
["Arun",null,119,7814,null,152.29076017404699,null,126.16026946939201,null,182.23859991309499,null,134.69999999999999,null,"No difference"]
["Chichester",null,70,5833,null,120.006857534716,null,93.551234163816005,null,151.62144522601099,null,134.69999999999999,null,"No difference"]
["Crawley",null,149,8318,null,179.129598461169,null,151.52242886777901,null,210.31165503053001,null,134.69999999999999,null,"Worse than England"]
["Horsham",null,90,7196,null,125.06948304613699,null,100.570635279852,null,153.731628226445,null,134.69999999999999,null,"No difference"]
["Mid Sussex",null,80,8489,null,94.239604193662402,null,74.726146219235801,null,117.289344912952,null,134.69999999999999,null,"Better than England"]
["Worthing",null,71,6317,null,112.395124267849,null,87.781525979326901,null,141.77115606431701,null,134.69999999999999,null,"No difference"]
["West Sussex ",null,638,47668,null,133.842410002517,null,123.65677653032,null,144.64329138702101,null,134.69999999999999,null,"No difference"]
["South East",null,7030,545710,null,128.823001227758,null,125.82902346937701,null,131.870230047436,null,134.69999999999999,null,"Better than England"]
["England",null,45708,3393356,null,134.69851085474099,null,133.466452585214,null,135.939111950366,null,134.69999999999999]
["   Hospital admissions due to injury of children aged 5 and under 2010/11 to 2012/13."]
[]
[null,null,null,"Adur",{"$f":"F549","v":159.41637395298599},{"$f":"J549-F549","v":46.219133858939017},{"$f":"E561-H549","v":38.061242639269992}]
[null,null,null,"Arun",{"$f":"F550","v":152.29076017404699},{"$f":"J550-F550","v":29.947839739047993},{"$f":"E562-H550","v":26.130490704654989}]
[null,null,null,"Chichester",120.006857534716,31.614587691294986,26.4556233709]
[null,null,null,"Crawley",179.129598461169,31.182056569361009,27.607169593389983]
[null,null,null,"Horsham",125.06948304613699,28.662145180308002,24.498847766284996]
[null,null,null,"Mid Sussex",94.239604193662402,23.049740719289602,19.513457974426601]
[null,null,null,"Worthing",112.395124267849,29.376031796468013,24.613598288522098]
[null,null,null,"West Sussex ",133.842410002517,10.800881384504009,10.185633472196997]
[null,null,null,"South East",128.823001227758,3.0472288196779971,2.9939777583809928]
["DEVELOPMENT",null,null,null,null,null,null,null,null,null,null,null,null,"back to top"]
["ASSESSED AS HAVING A \"GOOD LEVEL\" OF DEVELOPMENT AT AGE 5"]
["Why this is important",null,"Early childhood development has lifelong impact; intellectually, emotionally and physically. The Marmot Review into Health Inequalities identified early childhood development ('Give every child the best start in life') as its priority policy objective.",null,null,null,null,null,null,null,null,null,"This is an Ofsted KPI."]
["Indicators",null,"Two measures are shown, the percentage of children assessed as having a \"Good Level of Development\" (GLD) and the percentage gap between all children and the lowest 20% of achievers."]
["Statistical issues",null,"At centre level the number of pupils is small, the percentage may vary considerable from year to year and between centres, therefore confidence intervals are shown in relation to the % pupils attaining a Good Level of Development."]
["Good Level of Development (GLD)",null,null,null,null,null,null,null,null,null,null,null,null,null,"back to top"]
["2013 DATA",null,null,null,null,null,null,{"$f":"$D$71","v":"Kingston Buci"},null,{"$f":"$J$71","v":"Stepping Stones"},null,"West Sussex",null,"England"]
["Number of children (2013)",null,null,null,null,null,null,{"$f":"HLOOKUP(A577,cfc,DATA!$A$1+1,FALSE)","v":179},null,{"$f":"HLOOKUP(A577,cfc,DATA!$B$1+1,FALSE)","v":135}]
["Children Assessed as Having a \"Good Level of Development\" (2013)",null,null,null,null,null,null,{"$f":"HLOOKUP(A578,cfc,DATA!$A$1+1,FALSE)","v":88},null,{"$f":"HLOOKUP(A578,cfc,DATA!$B$1+1,FALSE)","v":68}]
["Percentage of children with a Good Level of Development (2013)",null,null,null,null,null,null,{"$f":"HLOOKUP(A579,cfc,DATA!$A$1+1,FALSE)","v":0.49162011173184356},null,{"$f":"HLOOKUP(A579,cfc,DATA!$B$1+1,FALSE)","v":0.50370370370370365},null,0.52,null,0.52]
["2014 DATA",null,null,null,null,null,null,{"$f":"$D$71","v":"Kingston Buci"},null,{"$f":"$J$71","v":"Stepping Stones"},null,"West Sussex",null,"England"]
["Number of children (2014)",null,null,null,null,null,null,{"$f":"HLOOKUP(A581,cfc,DATA!$A$1+1,FALSE)","v":172},null,{"$f":"HLOOKUP(A581,cfc,DATA!$B$1+1,FALSE)","v":122}]
["Children Assessed as Having a \"Good Level of Development\" (2014)",null,null,null,null,null,null,{"$f":"HLOOKUP(A582,cfc,DATA!$A$1+1,FALSE)","v":106},null,{"$f":"HLOOKUP(A582,cfc,DATA!$B$1+1,FALSE)","v":68}]
["Percentage of children with a Good Level of Development (2014)",null,null,null,null,null,null,{"$f":"HLOOKUP(A583,cfc,DATA!$A$1+1,FALSE)","v":0.61627906976744184},null,{"$f":"HLOOKUP(A583,cfc,DATA!$B$1+1,FALSE)","v":0.55737704918032782},null,0.59,null,0.6]
[null,null,null,2013,"DevLCL (2013)","DevUCL (2013)",2014,"DevLCL (2014)","DevUCL (2014)"]
[null,null,{"$f":"H576","v":"Kingston Buci"},{"$f":"H579","v":0.49162011173184356},{"$f":"D585-HLOOKUP(E584,cfc,DATA!$A$1+1,FALSE)","v":7.2287728807640783E-2},{"$f":"HLOOKUP(F584,cfc,DATA!$A$1+1,FALSE)-D585","v":7.26398480251505E-2},{"$f":"H583","v":0.61627906976744184},{"$f":"G585-HLOOKUP(H584,cfc,DATA!$A$1+1,FALSE)","v":7.4461125755117541E-2},{"$f":"HLOOKUP(I584,cfc,DATA!$A$1+1,FALSE)-G585","v":6.938062584097926E-2}]
[null,null,{"$f":"J576","v":"Stepping Stones"},{"$f":"J579","v":0.50370370370370365},{"$f":"D586-HLOOKUP(E584,cfc,DATA!$B$1+1,FALSE)","v":8.3268686821630078E-2},{"$f":"HLOOKUP(F584,cfc,DATA!$B$1+1,FALSE)-D586","v":8.3063739028907846E-2},{"$f":"J583","v":0.55737704918032782},{"$f":"G586-HLOOKUP(H584,cfc,DATA!$B$1+1,FALSE)","v":8.8550789697254551E-2},{"$f":"HLOOKUP(I584,cfc,DATA!$B$1+1,FALSE)-G586","v":8.5047785619826954E-2}]
[null,null,"West Sussex",{"$f":"L579","v":0.52},null,null,{"$f":"L583","v":0.59}]
[null,null,"England",{"$f":"N579","v":0.52},null,null,{"$f":"N583","v":0.6}]
[]
["GLD - Achievement Gap",null,null,null,null,null,null,null,null,null,null,null,null,null,"back to top"]
["The Achievement Gap compares the median score of all pupils with the mean score of the lowest 20% of all scores."]
["2013 DATA (Data relates to academic year 2012/13) Data for West Sussex and England provided is the published DfE data.",null,null,null,null,null,null,{"$f":"$D$71","v":"Kingston Buci"},null,{"$f":"$J$71","v":"Stepping Stones"},null,"West Sussex",null,"England"]
["Number of children (2013)",null,null,null,null,null,null,{"$f":"HLOOKUP(A593,cfc,DATA!$A$1+1,FALSE)","v":179},null,{"$f":"HLOOKUP(A593,cfc,DATA!$B$1+1,FALSE)","v":135}]
["Median Score all Children (2013)",null,null,null,null,null,null,{"$f":"HLOOKUP(A594,cfc,DATA!$A$1+1,FALSE)","v":34},null,{"$f":"HLOOKUP(A594,cfc,DATA!$B$1+1,FALSE)","v":34},null,34,null,34]
["Lowest Scores - 20% of All Children (2013)",null,null,null,null,null,null,{"$f":"HLOOKUP(A595,cfc,DATA!$A$1+1,FALSE)","v":35}]
["Mean Score of Lowest 20% (2013)",null,null,null,null,null,null,{"$f":"HLOOKUP(A596,cfc,DATA!$A$1+1,FALSE)","v":23.971428571428568},null,{"$f":"HLOOKUP(A596,cfc,DATA!$B$1+1,FALSE)","v":21.518518518518519},null,23.7,null,21.6]
["% Gap (2013)",null,null,null,null,null,null,{"$f":"HLOOKUP(A597,cfc,DATA!$A$1+1,FALSE)","v":0.29495798319327743},null,{"$f":"HLOOKUP(A597,cfc,DATA!$B$1+1,FALSE)","v":0.36710239651416121},null,0.30399999999999999,null,0.36599999999999999]
["2014 DATA (Data relates to academic year 2013/14) Data for West Sussex and England provided is the published DfE data.",null,null,null,null,null,null,{"$f":"$D$71","v":"Kingston Buci"},null,{"$f":"$J$71","v":"Stepping Stones"},null,"West Sussex",null,"England"]
["Number of children (2014)",null,null,null,null,null,null,{"$f":"HLOOKUP(A599,cfc,DATA!$A$1+1,FALSE)","v":172},null,{"$f":"HLOOKUP(A599,cfc,DATA!$B$1+1,FALSE)","v":122}]
["Median Score all Children (2014)",null,null,null,null,null,null,{"$f":"HLOOKUP(A600,cfc,DATA!$A$1+1,FALSE)","v":34},null,{"$f":"HLOOKUP(A600,cfc,DATA!$B$1+1,FALSE)","v":34},null,34,null,34]
["Lowest Scores - 20% of All Children (2014)",null,null,null,null,null,null,{"$f":"HLOOKUP(A601,cfc,DATA!$A$1+1,FALSE)","v":34},null,{"$f":"HLOOKUP(A601,cfc,DATA!$B$1+1,FALSE)","v":24}]
["Mean Score of Lowest 20% (2014)",null,null,null,null,null,null,{"$f":"HLOOKUP(A602,cfc,DATA!$A$1+1,FALSE)","v":26.941176470588232},null,{"$f":"HLOOKUP(A602,cfc,DATA!$B$1+1,FALSE)","v":23.166666666666668},null,24.5,null,22.5]
["% Gap (2014)",null,null,null,null,null,null,{"$f":"(H600-H602)/H600","v":0.20761245674740494},null,{"$f":"HLOOKUP(A603,cfc,DATA!$B$1+1,FALSE)","v":0.31862745098039214},null,0.27900000000000003,null,0.33900000000000002]
[null,null,2013,2014]
[null,{"$f":"H592","v":"Kingston Buci"},{"$f":"H597","v":0.29495798319327743},{"$f":"H603","v":0.20761245674740494}]
[null,{"$f":"J592","v":"Stepping Stones"},{"$f":"J597","v":0.36710239651416121},{"$f":"J603","v":0.31862745098039214}]
[null,{"$f":"L592","v":"West Sussex"},{"$f":"L597","v":0.30399999999999999},{"$f":"L603","v":0.27900000000000003}]
[null,{"$f":"N592","v":"England"},{"$f":"N597","v":0.36599999999999999},{"$f":"N603","v":0.33900000000000002}]

{"sheet":"DATA","index":1,"n_rows":82,"n_cols":227,"rows_kept":82,"cut":false,"hidden":false,"merged":[[0,223,0,226],[0,72,0,75],[0,221,0,222],[0,57,0,62],[0,63,0,68],[0,38,0,41],[0,69,0,71],[0,79,0,82],[0,198,0,220],[0,155,0,157],[0,175,0,179],[0,165,0,167],[0,83,0,94],[0,42,0,46],[0,182,0,196],[0,76,0,78],[0,47,0,51],[0,52,0,55],[0,95,0,106],[0,11,0,20],[0,31,0,37],[0,21,0,30]]}
[18,37,null,null,null,null,null,null,null,null,null,"Population MYE",null,null,null,null,null,null,null,null,null,"Population 0-4",null,null,null,null,null,null,null,null,null,"Ethnic Composition 0-4 (2011)",null,null,null,null,null,null,"Tenure 2011 (0-9s)",null,null,null,"All Births",null,null,null,null,"Births to Mothers Under 20 ",null,null,null,null,"Low Birth Weight",null,null,null,"Estimate of Teenage Mothers","Families 0-4 2011",null,null,null,null,null,"Households",null,null,null,null,null,"Lone parent families",null,null,"Lone parents data from census",null,null,null,"Deprivation",null,null,null,null,null,null,"Child Poverty",null,null,null,null,null,null,null,null,null,null,null,"Breastfeeding",null,null,null,null,null,null,null,null,null,null,null,null,null,null,null,null,null,null,null,null,null,null,null,null,null,null,null,null,null,null,null,null,null,null,null,null,null,null,null,null,null,null,null,null,null,null,null,null,null,null,null,null,null,null,null,null,null,null,null,"New EYFS",null,null,null,null,null,null,null,null,null,"New EYFS",null,null,null,null,null,null,null,null,null,"Proficiency in English",null,null,null,null,null,null,"Smoking Status",null,null,null,null,null,null,null,null,null,null,null,null,null,null,null,"Immunisations",null,null,null,null,null,null,null,null,null,null,null,null,null,null,null,null,null,null,null,null,null,null,"LTLI",null,"Lone or Couple Households of Households with 0-4 year olds"]
["CFC","Check","CFC Locality","CFC Group","District","GP Cluster","Wards","Education Locality Name","Education Partnership Area","CCG","Parliamentary Constituency","Population (2004)","Population (2005)","Population (2006)","Population (2007)","Population (2008)","Population (2009)","Population (2010)","Population (2011)","Population (2012)","Population (2013)","Under 5 (2004)","Under 5 (2005)","Under 5 (2006)","Under 5 (2007)","Under 5 (2008)","Under 5 (2009)","Under 5 (2010)","Under 5 (2011)","Under 5 (2012)","Under 5 (2013)","% White British","% White Irish and White Other","% Mixed/Multiple","% Asian","% Black","% Other","% BAME","Households with a child aged 0-9 years","% Owned","% Social rented","% Private rent/living rent free","All Births (2009)","All Births (2010)","All Births (2011)","All Births (2012)","All Births (2013)","Births to Mothers Under 20 (2009)","Births to Mothers Under 20 (2010)","Births to Mothers Under 20 (2011)","Births to Mothers Under 20 (2012)","Births to Mothers Under 20 (2013)","Number of babies born of low weight","% low weight","LCL","UCL","Estimation of teenage mothers in area","One dependent child families 2011 aged 0-4","Two dependent children families 2011 youngest aged 0-4","Three dependent children families 2011 youngest aged 0-4","families with 3 or more children %","All families","Total number of dependent children 2011","All Households with dependent children","Married Couple with dependent children","Same-Sex Civil Partnership Couple with dependent children","Cohabiting Couple with dependent children","Lone Parent with dependent children","Other Household type with dependent children","Lone parent families on low income - 2011","Lone parent families on low income - 2012","Lone parent families on low income - 2013","Lone parents (with dependent children) (2011)","Lone parents with dependent children - not in employment (2011)","% not in employment (2011)","Male Lone Parents (2011)","Local Decile","Households with 3 or 4 measures of deprivation","Deprived households as % of all households in area","0 to 4 year olds in Out-of-work Benefit Claimant Hholds (2010)","0 to 4 year olds in Out-of-work Benefit Claimant Hholds (2011)","0 to 4 year olds in Out-of-work Benefit Claimant Hholds (2012)","0 to 4 year olds in Out-of-work Benefit Claimant Hholds (2013)","Number 2007","% of Children in Poverty 2007","Number 2008","% of Children in Poverty 2008","Number 2009","% of Children in Poverty 2009","Number 2010","% of Children in Poverty 2010","Number 2011","% of Children in Poverty 2011","Number 2012","% of Children in Poverty 2012","Number of babies eligible 2012/13","Number of babies not checked 2012/13","Number of babies receiving check 2012/13","% of babies checked 2012/13","Exclusively breastfed 2012/13","Total including partially breastfed 2012/13","% exclusively breastfed 2012/13","% breastfeeding (including partially) 2012/13","exclusiveLCL","exclusiveUCL","partialLCL","partialUCL","2009/10 - Measured (Reception)","2009/10 - Measured as Obese (Reception)","% Obese (Reception) - 2009/10","2009/10 (Reception) - LCL","2009/10 (Reception) - UCL","2009/10 Significance (Reception)","2010/11 - Measured (Reception)","2010/11 - Measured as Obese (Reception)","% Obese (Reception) - 2010/11","2010/11 (Reception) - LCL","2010/11 (Reception) - UCL","2010/11 Significance (Reception)","2011/12 - Measured (Reception)","2011/12 - Measured as Obese (Reception)","% Obese (Reception) - 2011/12","2011/12 (Reception) - LCL","2011/12 (Reception) - UCL","2011/12 Significance (Reception)","2012/13 - Measured (Reception)","2012/13 - Measured as Obese (Reception)","% Obese (Reception) - 2012/13","2012/13 (Reception) - LCL","2012/13 (Reception) - UCL","2012/13 Significance (Reception)","2009/10 - Measured (Year 6)","2009/10 - Measured as Obese (Year 6)","% Obese (Year 6) - 2009/10","2009/10 (Year 6) - LCL","2009/10 (Year 6) - UCL","2009/10 Significance (Year 6)","2010/11 - Measured (Year 6)","2010/11 - Measured as Obese (Year 6)","% Obese (Year 6) - 2010/11","2010/11 (Year 6) - LCL","2010/11 (Year 6) - UCL","2010/11 Significance (Year 6)","2011/12 - Measured (Year 6)","2011/12 - Measured as Obese (Year 6)","% Obese (Year 6) - 2011/2012","2011/12 (Year 6) - LCL","2011/12 (Year 6) - UCL","2011/12 Significance (Year 6)","2012/13 - Measured (Year 6)","2012/13 - Measured as Obese (Year 6)","% Obese (Year 6) - 2012/2013","2012/13 (Year 6) - LCL","2012/13 (Year 6) - UCL","2012/13 Significance (Year 6)","Number of children (2013)","Children Assessed as Having a \"Good Level of Development\" (2013)","Percentage of children with a Good Level of Development (2013)","DevLCL (2013)","DevUCL (2013)","Number of Children (2013)","Median Score all Children (2013)","Lowest Scores - 20% of All Children (2013)","Mean Score of Lowest 20% (2013)","% Gap (2013)","Number of children (2014)","Children Assessed as Having a \"Good Level of Development\" (2014)","Percentage of children with a Good Level of Development (2014)","DevLCL (2014)","DevUCL (2014)","Number of Children (2014)","Median Score all Children (2014)","Lowest Scores - 20% of All Children (2014)","Mean Score of Lowest 20% (2014)","% Gap (2014)","Proficiency in English 2011","3-15 Main language is English 2011","3-15 Main language is not English 2011","3-15 Main language is not English : Can speak English very well or well 2011","3-15 Main language is not English : Cannot speak English or cannot speak English well 2011","% Main Language not english but can speak it well or very well","% Main language is not english and cannot speak it or cannot speak it well","%not smoking at time of booking","% smoking at time of booking","LCLbook","UCLbook","%not smoking at delivery","%smoking at delivery","LCLdel","UCLdel","%not current smoker","%current smoker","LCLsmoke","UCLsmoke","%No smoker in household","%Smoker in household","LCLhouse","UCLhouse","Immunisations Total age1 eligible Q1 2013-14","age1 2nd MenC","age1 2nd Pneu","age1 1st Pneu","age1 3rd5in1","total age2 eligible","age2 HibMenCBoost","age2 2ndMenC","age2 PneuBoost","age2 2ndPneu","age2 1stPneu","age2 MMR1","age2 3rd5in1","Total age5 eligible","age5 HibMenCBoost","age5 2ndMenC","age5 PneuBoost","age5 2ndPneu","age5 1stPneu","age5 MMR2","age5 MMR1","age5 PSB","age5 3rd5in1","Number of 0-4 year olds with their day-to-day activities limited","% of all 0-4 year olds","Households with a 0-4 year old","Living in a couple household","Not living in a couple household","% in non-couple household"]
["Angmering",null,"Arun East","Arun East","Arun","Arun","Angmering, Brookfield, Rustington East, Rustington West","Angmering","B","Coastal West Sussex","Arundel and South Downs",16620,17065,17415,17650,17770,17725,17835,17855,18075,18165,1015,1025,1040,1025,1030,1005,1010,990,1020,1020,0.92871690427698572,2.7494908350305498E-2,3.4623217922606926E-2,8.1466395112016286E-3,1.0183299389002036E-3,0,7.128309572301425E-2,2025,0.68083003952569165,9.3379446640316208E-2,0.2257905138339921,184,179,203,195,163,8,4,12,8,6,11,6.7484662576687116E-2,3.8096986536392215E-2,0.1167893289115334,13,308,333,133,0.13647543067212969,2175,3804,2189,1276,1,284,480,148,115,110,75,480,144,{"$f":"BV3/BU3","v":0.3},46,5,230,3.0006523157208087E-2,140,115,130,145,410,0.1341,470,0.12959999999999999,435,0.13210000000000002,440,0.14699999999999999,465,0.129,395,0.11791044776119403,191,4,187,0.98280761579994336,84,99,0.46804208863032398,0.54348343649814235,0.37964047544544022,0.52080051855167575,0.458000343620654,0.59963908090733153,161,10,6.2111801242236024E-2,3.4084412068514494E-2,0.11054824886072183,{"$f":"IF(DG3>$DH$77,\"Sig worse than Eng.\",(IF(DH3<$DG$77,\"Sig better than Eng.\",\"No Sig diff\")))","v":"No Sig diff"},163,9,5.5214723926380369E-2,2.9317368755345873E-2,0.10159409039323013,{"$f":"IF(DM3>$DN$77,\"Sig worse than Eng.\",(IF(DN3<$DM$77,\"Sig better than Eng.\",\"No Sig diff\")))","v":"No Sig diff"},130,9,6.9230769230769235E-2,3.6847119144994243E-2,0.12634191819174664,{"$f":"IF(DS3>$DT$77,\"Sig worse than Eng.\",(IF(DT3<$DS$77,\"Sig better than Eng.\",\"No Sig diff\")))","v":"No Sig diff"},165,16,9.696969696969697E-2,6.0572005169180751E-2,0.15170677440922217,{"$f":"IF(DY3>$DZ$77,\"Sig worse than Eng.\",(IF(DZ3<$DY$77,\"Sig better than Eng.\",\"No Sig diff\")))","v":"No Sig diff"},174,26,0.14942528735632185,0.10405726954201303,0.20993846121160956,{"$f":"IF(EE3>$EF$77,\"Sig worse than Eng.\",(IF(EF3<$EE$77,\"Sig better than Eng.\",\"No Sig diff\")))","v":"No Sig diff"},171,30,0.17543859649122806,0.12574362675464065,0.23939550701434556,{"$f":"IF(EK3>$EL$77,\"Sig worse than Eng.\",(IF(EL3<$EK$77,\"Sig better than Eng.\",\"No Sig diff\")))","v":"No Sig diff"},191,35,0.18324607329842932,0.13481200656779935,0.24417026582756324,{"$f":"IF(EQ3>$ER$77,\"Sig worse than Eng.\",(IF(ER3<$EQ$77,\"Sig better than Eng.\",\"No Sig diff\")))","v":"No Sig diff"},186,18,9.6774193548387094E-2,6.2093076397520854E-2,0.14777393088419472,{"$f":"IF(EW3>$EX$77,\"Sig worse than Eng.\",(IF(EX3<$EW$77,\"Sig better than Eng.\",\"No Sig diff\")))","v":"Sig better than Eng."},180,99,0.55000000000000004,0.4770335504141382,0.62087689979370053,180,34,36,25.361111111111111,{"$f":"(FF3-FH3)/FF3","v":0.25408496732026142},219,132,0.60273972602739723,0.53669727911714793,0.66524000956398821,219,34,43,24.883720930232553,0.26812585499316022,2763,2742,21,15,6,{"$f":"FW3/FV3","v":0.7142857142857143},{"$f":"FX3/FV3","v":0.2857142857142857},0.9612962962962962,3.8703703703703699E-2,1.9930699774880899E-2,9.0972566500489863E-2,0.95129629629629631,4.8703703703703707E-2,1.9930699774880899E-2,9.0972566500489863E-2,0.95759259259259255,4.2407407407407408E-2,2.4605238882088657E-2,0.1002995507590243,0.86300158175158193,0.13699841824841824,9.0616305858033777E-2,0.2064663742592043,59,55,55,58,55,56,53,55,53,55,55,51,55,56,56,55,54,56,56,55,56,55,56,19,1.9348268839103868E-2,1542,1390,152,9.8573281452658881E-2]
["Bewbush",null,"Crawley","Crawley","Crawley","Crawley","Bewbush, Gossops Green","Crawley NW","C1","Crawley","Crawley",13920,13945,14000,13975,14045,14080,14005,14160,14250,14270,930,950,930,935,950,975,1040,1085,1120,1145,0.6158088235294118,7.6286764705882359E-2,7.6286764705882359E-2,0.13235294117647059,8.2720588235294115E-2,1.6544117647058824E-2,0.38419117647058826,1980,0.4770085901970692,0.32491157150075795,0.19807983830217282,228,218,200,196,236,17,13,8,14,15,22,9.3220338983050849E-2,6.2367935694190454E-2,0.13710324437589275,26,337,306,203,0.16940932161849653,1995,3572,1958,991,1,250,500,216,215,180,165,519,232,{"$f":"BV4/BU4","v":0.44701348747591524},39,2,287,5.3524804177545689E-2,260,265,285,265,735,0.22277777777777777,705,0.20399999999999999,665,0.21177777777777773,645,0.22133333333333327,710,0.22855555555555554,695,0.22347266881028938,199,9,190,0.95615563530037218,63,90,0.31451973653586557,0.46319733432636662,0.26855754915982444,0.40127596438938273,0.40391272589420474,0.54449876059785884,139,13,9.3525179856115109E-2,5.5472392932265871E-2,0.153440755022583,"No Sig diff",167,17,0.10179640718562874,6.453215761708575E-2,0.15696828543643829,"No Sig diff",148,15,0.10135135135135136,6.2386399530736276E-2,0.160487241723308,{"$f":"IF(DS4>$DT$77,\"Sig worse than Eng.\",(IF(DT4<$DS$77,\"Sig better than Eng.\",\"No Sig diff\")))","v":"No Sig diff"},185,22,0.11891891891891893,7.9857528522488064E-2,0.17348439713018241,"No Sig diff",133,30,0.22556390977443608,0.16281825028236413,0.30371769117048725,"No Sig diff",167,39,0.23353293413173654,0.17580094582420591,0.30324822283567104,{"$f":"IF(EK4>$EL$77,\"Sig worse than Eng.\",(IF(EL4<$EK$77,\"Sig better than Eng.\",\"No Sig diff\")))","v":"No Sig diff"},177,39,0.22033898305084745,0.1655797355444994,0.28697942513911712,{"$f":"IF(EQ4>$ER$77,\"Sig worse than Eng.\",(IF(ER4<$EQ$77,\"Sig better than Eng.\",\"No Sig diff\")))","v":"No Sig diff"},160,33,0.20624999999999999,0.15080086366994011,0.27547377599331924,{"$f":"IF(EW4>$EX$77,\"Sig worse than Eng.\",(IF(EX4<$EW$77,\"Sig better than Eng.\",\"No Sig diff\")))","v":"No Sig diff"},212,105,0.49528301886792453,0.42866607213368668,0.56206786743970427,212,34,42,21.976190476190471,{"$f":"(FF4-FH4)/FF4","v":0.35364145658263318},193,109,0.56476683937823835,0.4942308877461517,0.63277487694274381,193,34,38,21.552631578947373,0.36609907120743018,1852,1811,41,36,5,0.87804878048780488,0.12195121951219512,0.83758648758648768,0.1624135124135124,0.11561771988481866,0.25849709964566014,0.87920227920227922,0.12079772079772079,7.8811990941745763E-2,0.20589065995023004,0.80054945054945059,0.19945054945054946,0.14772120660505175,0.30194390108014951,0.64439017772351104,0.35560982227648902,0.27361966173474211,0.45325977192245154,55,53,53,55,54,50,50,49,48,49,48,49,50,62,59,57,53,57,57,57,59,55,57,24,2.2058823529411766E-2,1737,1485,252,0.14507772020725387]
["Billingshurst and Pulborough",null,"Horsham","Horsham Rural","Horsham","Chanctonbury","Wishborough Green, Chanctonbury, Pulborough and Coldwatham, Plaistow, Billingshurst and Shipley, Itchingfield, Slinford and Warnham","Billingshurst","C3","Coastal West Sussex","Horsham",24270,24350,24640,24855,25020,25175,25585,25835,25910,26075,1240,1220,1195,1235,1235,1235,1285,1290,1300,1295,0.92938496583143504,2.2779043280182234E-2,3.4927866362946092E-2,9.8709187547456334E-3,2.2779043280182231E-3,7.5930144267274111E-4,7.0615034168564919E-2,2665,0.74652647390161475,0.13931656027037176,0.11415696582801352,211,215,225,196,185,8,2,4,6,3,17,9.1891891891891897E-2,5.8164744484854133E-2,0.14222270780984969,5,372,445,205,0.15210646167041827,2831,5095,2877,1861,0,331,494,191,85,75,70,383,109,0.28459530026109658,46,8,209,1.9179590713040286E-2,140,140,110,120,385,7.7374999999999985E-2,410,8.0249999999999988E-2,445,9.5125000000000015E-2,360,8.9999999999999983E-2,350,8.3000000000000004E-2,310,7.0857142857142855E-2,188,6,182,0.96200284090909094,87,109,0.48906351001939236,0.62833997089511795,0.40665663560429499,0.55029595197566561,0.52635968482548634,0.66735367106469112,208,14,6.7307692307692304E-2,4.0513731011622561E-2,0.1097942351341602,"No Sig diff",258,21,8.1395348837209308E-2,5.3851900260729016E-2,0.12122144002372841,"No Sig diff",129,7,5.4263565891472867E-2,2.6530955330892243E-2,0.10777545005702245,"No Sig diff",197,15,7.6142131979695438E-2,4.6683361087312907E-2,0.12181501080963128,"No Sig diff",207,34,0.16400000000000001,0.12,0.221,"No Sig diff",213,31,0.14599999999999999,0.104,0.19900000000000001,"No Sig diff",205,27,0.13170731707317074,9.2119520186502241E-2,0.18484396755831045,"Sig better than Eng.",193,19,9.8445595854922283E-2,6.3932503429260476E-2,0.14863175549958713,"Sig better than Eng.",243,152,0.62551440329218111,0.56315198511017772,0.68397019724700259,243,34,48,26.041666666666671,0.23406862745098025,294,196,0.66666666666666663,0.61093750591623186,0.71809660635286543,294,34,58,26.586206896551726,0.21805273833671393,3760,3670,90,72,18,0.8,0.2,0.94310290404040398,5.6897095959595953E-2,5.4117934063799819E-2,0.18113867504246287,0.96440972222222221,3.5590277777777776E-2,1.7614201033819141E-2,0.10993207132684676,0.9656723484848484,3.4327651515151512E-2,1.7614201033819141E-2,0.10993207132684676,0.86806344696969695,0.13193655303030305,9.607722097921384E-2,0.24688972487264566,58,56,56,56,56,62,58,57,58,58,57,59,58,60,59,57,56,55,55,55,58,54,59,14,1.0630220197418374E-2,2072,1939,133,6.4189189189189186E-2]
["Bognor Nursery School",null,"Arun West","Arun West South","Arun","Arch","Aldwick East, Aldwick West, Bersted, Hotham, Marine, Pagham and Rose Green, Pevensey","Bognor Regis/Felpham","A","Coastal West Sussex","Bognor Regis and Littlehampton",30475,30680,30925,31290,31455,31615,31785,31830,32005,32230,1185,1220,1250,1320,1370,1485,1520,1605,1620,1640,0.82069408740359895,0.11632390745501285,3.4704370179948589E-2,2.570694087403599E-2,1.2853470437017994E-3,1.2853470437017994E-3,0.17930591259640102,2780,0.54025880661394676,0.10639827462257369,0.35334291876347951,315,328,344,357,338,33,20,22,18,21,22,6.5088757396449703E-2,4.3373169178803433E-2,9.6579015046423536E-2,39,590,458,203,0.13043955261306833,2956,4972,2979,1514,2,478,708,277,225,215,190,702,263,0.37464387464387466,63,2,766,5.2176282269600166E-2,285,275,300,275,780,0.16229999999999997,785,0.15945000000000004,795,0.16625000000000004,740,0.16325000000000003,745,0.16159999999999999,650,0.14541387024608501,340,7,333,0.98093690478792794,123,149,0.36648709844905497,0.45325752307274042,0.31929566467294879,0.42242269790459519,0.39494261979372203,0.50115097434666911,269,33,0.12267657992565056,8.8701014841697901E-2,0.1672771606253689,"No Sig diff",228,23,0.10087719298245613,6.8163691398398854E-2,0.14681709363557319,"No Sig diff",261,37,0.1417624521072797,0.10462973464394934,0.18928746082579473,"Sig worse than Eng.",297,28,9.4276094276094277E-2,6.6032790014041221E-2,0.13288081403266863,"No Sig diff",205,42,0.20487804878048779,0.15529811076434766,0.2653150151768599,"No Sig diff",218,44,0.20183486238532111,0.15392950781363002,0.26006641210558595,"No Sig diff",200,37,0.185,0.13730192800616048,0.24457062761151749,"No Sig diff",189,36,0.19047619047619047,0.14087796358983723,0.25240602878657525,"No Sig diff",314,104,0.33121019108280253,0.28146844278901645,0.38503195526069667,314,31.5,62,20.790322580645157,0.33998975934459819,308,163,0.52922077922077926,0.47345984299613758,0.58426179564700975,308,34,61,23.983606557377048,0.29459980713596917,3362,3150,212,153,59,0.72169811320754718,0.27830188679245282,0.86148268398268379,0.13851731601731601,0.10424930622012753,0.21607377511371989,0.86108405483405481,0.13891594516594516,0.13636267428550469,0.25810697999374121,0.89908189033189034,0.10091810966810966,8.3456724788453618E-2,0.18743530791512816,0.78010010822510822,0.21989989177489172,0.20309234864592962,0.33967045152411318,71,70,70,70,70,83,78,81,78,80,82,78,81,94,89,84,85,85,85,85,91,83,87,33,2.1249195106245976E-2,2484,2170,314,0.12640901771336555]
["Boundstone Nursery School",null,"Adur","Adur West","Adur","Adur","Churchill, Cokeham, Manor, Peverel","Lancing","B","Coastal West Sussex","East Worthing and Shoreham",15885,15800,15880,15870,15825,15785,15830,15875,16025,16035,785,785,780,805,795,830,875,875,900,890,0.90700344431687718,3.0998851894374284E-2,3.9035591274397242E-2,1.6073478760045924E-2,2.2962112514351321E-3,4.5924225028702642E-3,9.2996555683122845E-2,1630,0.62208588957055211,0.2,0.17791411042944785,174,177,160,182,172,11,14,8,8,3,13,7.5581395348837205E-2,4.4699432822978308E-2,0.12500718256130097,13,273,263,144,0.1399705626162511,1701,2988,1715,881,2,268,414,150,130,130,120,414,173,0.41787439613526572,48,2,348,4.912478825522304E-2,190,160,155,160,465,0.17127272727272727,480,0.18736363636363637,525,0.1861818181818182,510,0.17681818181818182,505,0.16472727272727272,380,0.14258911819887429,191,12,179,0.92896194714376534,63,77,0.34698049701106859,0.42505038540734452,0.28577066576321652,0.42436094542373431,0.35985509909603769,0.50341452882233539,134,10,7.4626865671641784E-2,4.10383252681309E-2,0.13192457736414165,"No Sig diff",133,16,0.12030075187969924,7.5421813311987967E-2,0.18649777691729955,"No Sig diff",145,17,0.11724137931034483,7.4501409163335197E-2,0.17973863336594997,"No Sig diff",157,12,7.6433121019108277E-2,4.42610640242889E-2,0.12883770680774978,"No Sig diff",134,21,0.15671641791044777,0.10484592586579597,0.22772062713568716,"No Sig diff",141,16,0.11347517730496454,7.1065842891182035E-2,0.17638719377744136,"Sig better than Eng.",124,23,0.18548387096774194,0.12689752251284481,0.26297176778209758,"No Sig diff",120,21,0.17499999999999999,0.1174053594456646,0.2527570987264926,"No Sig diff",176,88,0.5,0.42692426588174481,0.57307573411825519,176,34,35,20.428571428571427,0.39915966386554624,166,94,0.5662650602409639,0.49021826324741552,0.63931430290432689,166,34,33,21.151515151515156,0.3778966131907307,2109,2086,23,19,4,0.82608695652173914,0.17391304347826086,0.83149350649350662,0.16850649350649349,0.10610728809302103,0.26237061298884162,0.86493506493506489,0.13506493506493505,7.9758668273817196E-2,0.2233893605061692,0.87402597402597404,0.12597402597402596,7.1252008979545867E-2,0.21011939569981511,0.7033549783549784,0.29664502164502166,0.24027691667974599,0.43307372181087261,43,43,43,43,43,48,47,48,48,48,48,47,48,51,50,49,47,49,50,49,49,49,49,19,2.1814006888633754E-2,1364,1181,183,0.13416422287390029]
["Broadfield",null,"Crawley","Crawley","Crawley","Crawley","Broadfield North, Broadfield South","Crawley SW","C1","Crawley","Crawley",12445,12395,12545,12795,12885,12975,13115,13335,13525,13620,990,960,985,1050,1105,1125,1140,1215,1225,1240,0.59493670886075944,7.4261603375527424E-2,8.6919831223628688E-2,0.15274261603375527,8.1012658227848103E-2,1.0126582278481013E-2,0.4050632911392405,2080,0.36184526669870254,0.45218644882268139,0.18596828447861605,271,217,257,242,230,16,13,15,17,13,23,0.1,6.7562529376324273E-2,0.14557956729059632,33,371,307,237,0.20270331436266686,1922,3554,1924,855,0,292,551,226,220,215,180,554,274,0.49458483754512633,38,1,354,6.9019302008188732E-2,300,305,310,285,865,0.29162500000000002,835,0.29075000000000001,920,0.28887499999999999,900,0.26974999999999999,920,0.27224999999999999,835,0.25692307692307692,225,5,220,0.97474614845938379,62,96,0.28009202635524344,0.4366472866418617,0.22650690611361948,0.34461838963122865,0.37247710485794949,0.50243443973429791,157,13,8.2802547770700632E-2,4.9027139712768814E-2,0.13650623606916407,"No Sig diff",168,14,8.3333333333333329E-2,5.0287335078460824E-2,0.13500822187976255,"No Sig diff",143,15,0.1048951048951049,6.4604118377760339E-2,0.16585844371117539,"No Sig diff",163,20,0.12269938650306748,8.0850124663024187E-2,0.18192304413197474,"No Sig diff",177,36,0.20338983050847459,0.15068707463179581,0.26869385336597923,"No Sig diff",181,38,0.20994475138121546,0.15695179474513435,0.27499382681666318,"No Sig diff",153,39,0.25490196078431371,0.1924372049079571,0.32937290471527553,"No Sig diff",158,30,0.189873417721519,0.13636351813386116,0.25810560792255161,"No Sig diff",207,69,0.33333333333333331,0.27266724717919089,0.40007263810741361,207,32,41,21.829268292682929,0.31783536585365846,215,109,0.50697674418604655,0.44061558411635232,0.57309297008615845,215,33,43,23.720930232558143,0.28118393234672295,1496,1462,34,31,3,0.91176470588235292,8.8235294117647065E-2,0.84342567155067161,0.15657432844932845,8.7488565256567077E-2,0.21410279669076451,0.87394621310062481,0.12605378689937513,6.8476557040876879E-2,0.18692562848208755,0.83940781440781431,0.16059218559218558,8.9885841771810929E-2,0.21951596207067745,0.64253541597291597,0.35746458402708403,0.26697228641216703,0.43851804693911739,64,61,62,63,62,68,66,64,66,66,67,66,67,55,49,50,46,51,51,47,53,46,53,23,1.9409282700421943E-2,1876,1558,318,0.16950959488272921]
["Chichester Nursery School",null,"Chichester","Chichester Central","Chichester","Arch","Chichester East, Chichester North, Chichester South, Chichester West","Chichester","A","Coastal West Sussex","Chichester",19720,19985,20275,20625,21090,21365,21635,22095,22315,22590,905,890,915,960,1035,1125,1150,1190,1280,1270,0.81996587030716728,5.2047781569965867E-2,4.0102389078498293E-2,7.0819112627986347E-2,1.2798634812286689E-2,4.2662116040955633E-3,0.18003412969283278,2055,0.39591439688715951,0.36138132295719844,0.24270428015564202,289,258,276,263,249,21,13,12,12,11,19,7.6305220883534142E-2,4.9391419828431059E-2,0.11609354065175088,24,419,336,165,0.13016063543675108,2127,3619,2146,1061,1,342,569,173,195,205,180,568,201,0.35387323943661969,31,4,447,4.3909626719056974E-2,270,255,285,240,630,0.18153846153846154,625,0.19546153846153849,655,0.1872307692307692,640,0.17776923076923079,580,0.17584615384615385,620,0.18452380952380953,248,20,228,0.90710009673220382,110,137,0.51035256140017105,0.6346676579044277,0.41842368815450531,0.5470699937386494,0.53614491289284405,0.66226641622151672,189,16,8.4656084656084651E-2,5.2779295230983923E-2,0.13308042103480033,"No Sig diff",168,16,9.5238095238095233E-2,5.9474309403575239E-2,0.14909851735584179,"No Sig diff",182,11,6.043956043956044E-2,3.4080238457120229E-2,0.10497085910032415,"No Sig diff",196,18,9.1836734693877556E-2,5.8881065123373738E-2,0.14048426705447778,"No Sig diff",154,26,0.16883116883116883,0.11789803397793083,0.23588391430049524,"No Sig diff",164,31,0.18902439024390244,0.13648306944540137,0.25580057300692555,"No Sig diff",158,29,0.18354430379746836,0.13094420921847771,0.25116714390031081,"No Sig diff",140,17,0.12142857142857143,7.7212614630050802E-2,0.18586493707821899,"Sig better than Eng.",227,104,0.45814977973568283,0.39456855561808551,0.5231238723492917,227,33,45,21.177777777777777,0.35824915824915826,226,114,0.50442477876106195,0.43971293258807637,0.56898871771584147,226,34,45,21.111111111111107,0.37908496732026153,3106,2866,240,204,36,0.85,0.15,0.73809523809523803,0.26190476190476192,0.18241416061863377,0.43179527736167544,0.79548229548229543,0.20451770451770454,0.13307691028989047,0.3653953590845116,0.70317460317460312,0.29682539682539688,0.18241416061863377,0.43179527736167544,0.57667887667887663,0.42332112332112332,0.34471090015787464,0.61671004364015625,63,61,61,62,60,63,60,60,60,60,62,60,61,65,58,58,54,56,58,55,58,56,59,23,1.9658119658119658E-2,1797,1563,234,0.1302170283806344]
["Durrington",null,"Worthing","Worthing","Worthing","CCC","Durrington, Northbrook, Salvington","Worthing","B","Coastal West Sussex","Worthing West",13400,13385,13345,13375,13325,13320,13355,13510,13590,13685,765,790,805,830,855,845,865,915,905,885,0.88402625820568925,3.1728665207877461E-2,4.8140043763676151E-2,2.6258205689277898E-2,5.4704595185995622E-3,4.3763676148796497E-3,0.11597374179431072,1755,0.52367370222475751,0.27381631488876212,0.20250998288648031,173,162,167,138,151,15,8,5,5,5,11,7.2847682119205295E-2,4.1161071759033392E-2,0.12572872001578086,12,235,245,197,0.18163608010354493,1712,3142,1599,821,0,244,398,136,165,135,80,461,196,0.42516268980477223,44,2,315,5.5545759125374711E-2,210,220,215,170,655,0.21077777777777779,675,0.20688888888888887,700,0.23699999999999999,645,0.22866666666666666,670,0.21488888888888888,550,0.20220588235294118,146,13,133,0.93420804685510572,48,67,0.38012805766428953,0.51493367073077223,0.28424408653110661,0.44537029973739656,0.41988066594915235,0.58742705334088818,122,13,0.10655737704918032,6.3336996121428402E-2,0.17379835736500793,"No Sig diff",133,13,9.7744360902255634E-2,5.8014803824288148E-2,0.16005842542852139,"No Sig diff",150,12,0.08,4.6353641518652906E-2,0.13462136375053141,"No Sig diff",170,13,7.6470588235294124E-2,4.5231780539752423E-2,0.12642726456452041,"No Sig diff",115,15,0.13043478260869565,8.0663846927720689E-2,0.20409754153481507,"No Sig diff",132,18,0.13636363636363635,8.8028458868182197E-2,0.20526534971262397,"No Sig diff",130,32,0.24615384615384617,0.18009792380442399,0.32678133034044121,"No Sig diff",127,14,0.11023622047244094,6.6810002178845376E-2,0.17654909139660793,"Sig better than Eng.",193,111,0.57512953367875652,0.50459186111857379,0.64273482592054509,193,34,38,22.710526315789476,0.33204334365325072,179,106,0.59217877094972071,0.5189842940127406,0.66149993649409367,179,34,35,23.685714285714287,0.3033613445378151,2189,2150,39,29,10,0.74358974358974361,0.25641025641025639,null,0.1388888888888889,6.0817253631150994E-2,0.28659851280393195,null,0.1111111111111111,4.4065689087418335E-2,0.25315129015036325,null,0.1388888888888889,6.0817253631150994E-2,0.28659851280393195,null,0.27777777777777779,0.15848170025813799,0.43992800216345151,44,44,44,44,44,49,45,47,44,47,48,44,47,52,50,50,48,50,50,48,50,50,50,21,2.2975929978118162E-2,1339,1144,195,0.14563106796116504]
["East Preston",null,"Arun East","Arun East","Arun","Arun","Beach, Brookfield, East Preston with Kingston, Rustington East, Rustington West","Angmering","B","Coastal West Sussex","Worthing West",18385,18325,18400,18435,18385,18475,18365,18420,18370,18475,700,680,700,690,665,665,630,625,640,640,0.92197452229299359,3.662420382165605E-2,2.8662420382165606E-2,7.9617834394904458E-3,4.7770700636942673E-3,0,7.8025477707006366E-2,1305,0.70574712643678161,8.2758620689655171E-2,0.21149425287356322,109,130,144,114,112,6,6,4,5,3,9,8.0357142857142863E-2,4.2850577836899766E-2,0.14569555273714238,7,215,210,80,0.13170846878159082,1518,2647,1520,917,0,193,305,105,65,70,55,305,84,0.27540983606557379,35,6,225,2.5426601875918182E-2,85,95,100,75,265,0.12575000000000003,230,0.11291666666666668,275,0.10883333333333334,280,9.0583333333333335E-2,315,0.10483333333333332,250,0.10845986984815618,115,5,110,0.97034447034447036,36,49,0.32016452115136323,0.44229655578339794,0.24670999220537851,0.41949287212541092,0.35597557115906309,0.53861480705065989,100,5,0.05,2.1543679154367969E-2,0.11175046923191914,"No Sig diff",108,11,0.10185185185185185,5.7829317593360803E-2,0.17322506146408276,"No Sig diff",83,6,7.2289156626506021E-2,3.3550295522992796E-2,0.14886786091773177,"No Sig diff",130,10,7.6923076923076927E-2,4.2317437086078179E-2,0.13581465315536376,"No Sig diff",144,19,0.13194444444444445,8.6122870939953716E-2,0.19689286195700392,"No Sig diff",139,20,0.14388489208633093,9.5114077729757537E-2,0.21180983065546405,"No Sig diff",117,11,9.4017094017094016E-2,5.3310461939706823E-2,0.16053550676080314,"Sig better than Eng.",132,16,0.12121212121212122,7.6004168709792846E-2,0.18784354856188021,"Sig better than Eng.",143,75,0.52447552447552448,0.44305846825994299,0.6046119924956096,143,34,28,26.035714285714278,0.23424369747899185,151,101,0.66887417218543044,0.59043982267317197,0.73892932941585499,151,34,30,25.06666666666667,0.26274509803921559,1891,1871,20,17,3,0.85,0.15,0.94504477004477005,5.4955229955229966E-2,2.4232521079919089E-2,0.12485581862986618,0.95933048433048429,4.0669515669515668E-2,1.7614201033819141E-2,0.10993207132684676,0.96858974358974359,3.141025641025641E-2,1.1529012223652576E-2,9.4475192787893972E-2,0.83746438746438756,0.16253561253561252,0.11649367959569261,0.27805683470612508,32,31,31,32,31,41,41,40,41,40,41,40,40,37,36,36,35,36,36,35,37,35,37,17,2.7113237639553429E-2,1001,902,99,9.8901098901098897E-2]
["EG Library",null,"Mid Sussex","Mid Sussex","Mid Sussex","Mid Sussex","Ashurst Wood, East Grinstead Herontye, East Grinstead Imberhorne, East Grinstead Town","East Grinstead","C2","Horsham and Mid Sussex","Mid Sussex",12920,13055,13210,13500,13645,13800,13935,13995,14095,14340,620,630,660,705,720,735,760,750,760,740,0.89719626168224298,4.2723631508678236E-2,2.67022696929239E-2,2.4032042723631509E-2,8.0106809078771702E-3,1.3351134846461949E-3,0.10280373831775701,1465,0.72832764505119452,9.6928327645051188E-2,0.17474402730375427,125,138,133,121,135,4,4,5,1,1,9,6.6666666666666666E-2,3.5466897784925636E-2,0.12184532729692925,5,200,262,111,0.14288639946679255,1580,2804,1939,1346,0,191,296,106,45,55,35,275,50,0.18181818181818182,20,10,148,2.4983119513841998E-2,65,60,50,55,160,7.9111111111111104E-2,155,7.1444444444444449E-2,170,7.7333333333333323E-2,155,6.5888888888888886E-2,175,6.6555555555555562E-2,135,6.0402684563758392E-2,131,4,127,0.96990740740740744,65,82,0.52671965715443969,0.65975867932389676,0.42581263792217539,0.5971158496536414,0.55932258310542216,0.72346209699631914,93,7,7.5268817204301078E-2,3.6936683981680471E-2,0.14729700103258914,"No Sig diff",117,6,5.128205128205128E-2,2.3712378528816573E-2,0.10738053424543133,"No Sig diff",99,4,4.0404040404040407E-2,1.5822638994147552E-2,9.9320212502542235E-2,"No Sig diff",127,9,7.0866141732283464E-2,3.7728059261201326E-2,0.12920265992793412,"No Sig diff",89,18,0.20224719101123595,0.13193782732624648,0.29719651983691514,"No Sig diff",88,11,0.125,7.1252741521922444E-2,0.21011755847674671,"No Sig diff",114,10,8.771929824561403E-2,4.8345105411009899E-2,0.15397298415856123,"Sig better than Eng.",99,7,7.0707070707070704E-2,3.4670230283234689E-2,0.13881485078510192,"Sig better than Eng.",147,81,0.55102040816326525,0.47033523732756821,0.62910691947250996,147,34,29,25.344827586206897,0.25456389452332656,126,91,0.72222222222222221,0.63832593390940506,0.79296928187628457,126,34,25,26.839999999999996,0.21058823529411774,2038,1990,48,42,6,0.875,0.125,0.91865338728083834,8.1346612719161743E-2,7.2097514909401916E-2,0.22281995332477456,0.92518933499325662,7.4810665006743438E-2,6.2724910645863163E-2,0.20745281963161774,0.90939412802157904,9.0605871978421001E-2,8.1682478239274645E-2,0.23797472795159738,0.8110488639900405,0.18895113600995952,0.13214965937388246,0.31120623660046737,38,36,36,36,36,36,34,34,34,34,34,34,34,46,42,42,40,40,43,40,42,41,42,13,1.7356475300400534E-2,1182,1119,63,5.3299492385786802E-2]
["EG Urban (Blackwells)",null,"Mid Sussex","Mid Sussex","Mid Sussex","Mid Sussex","East Grinstead Ashplats, East Grinstead Baldwins, East Grinstead Town","East Grinstead","C2","Horsham and Mid Sussex","Mid Sussex",11425,11570,11630,11770,11975,12235,12420,12625,12605,12705,740,720,710,705,740,730,790,795,865,845,0.85231539424280356,4.005006257822278E-2,6.0075093867334166E-2,4.005006257822278E-2,5.0062578222778474E-3,2.5031289111389237E-3,0.1476846057571965,1525,0.65094957432874923,0.18925998690242304,0.15979043876882776,137,147,158,170,131,5,7,7,5,2,9,6.8702290076335881E-2,3.6562545650761696E-2,0.12541626273440917,6,249,267,115,0.11891938392374067,1596,2772,1536,1047,1,176,235,77,65,70,50,316,85,0.26898734177215189,26,8,165,3.1488549618320608E-2,90,110,95,75,250,8.8142857142857162E-2,270,8.671428571428573E-2,250,0.10185714285714287,205,0.108,210,0.10014285714285712,230,9.5634095634095639E-2,152,6,146,0.95652513879114864,63,80,0.43148895922005176,0.53734948524864501,0.35393919302495835,0.51258652479973121,0.46701649179589177,0.62641550572682558,87,7,8.0459770114942528E-2,3.9520271089868816E-2,0.15688188990922067,"No Sig diff",119,10,8.4033613445378158E-2,4.6284809194831765E-2,0.14779835335938682,"No Sig diff",104,5,4.807692307692308E-2,2.070804232585223E-2,0.10764202797232544,"No Sig diff",145,13,8.9655172413793102E-2,5.3143530294794135E-2,0.14734804683119626,"No Sig diff",105,12,0.11428571428571428,6.6597020035790502E-2,0.1892012678809514,"No Sig diff",116,10,8.6206896551724144E-2,4.7499354799614958E-2,0.15144230575181017,"Sig better than Eng.",105,18,0.17142857142857143,0.11127785378367308,0.25477253962688479,"No Sig diff",125,18,0.14399999999999999,9.3068950253000618E-2,0.21615961006732778,"No Sig diff",159,102,0.64150943396226412,0.56443995549802972,0.71190244726532192,159,34,31,26.903225806451605,0.20872865275142338,141,83,0.58865248226950351,0.50612931176565457,0.66647320275989053,141,34,28,25.785714285714285,0.24159663865546221,1928,1895,33,30,3,0.90909090909090906,9.0909090909090912E-2,0.87410399124684857,0.1258960087531516,8.167987995453567E-2,0.20088987633992925,0.91388421102706829,8.6115788972931817E-2,3.8969900613698788E-2,0.13322597203376074,0.86807430664573537,0.13192569335426479,8.2363400835368833E-2,0.20245179541134131,0.76172969887255593,0.23827030112744399,0.17652266116613055,0.32679486242234518,40,39,39,39,39,34,31,32,31,32,32,31,32,41,33,36,34,36,37,35,34,34,37,15,1.8773466833541929E-2,1264,1157,107,8.4651898734177208E-2]
["Felpham",null,"Arun West","Arun West South","Arun","Arch","Felpham East, Felpham West, Hotham, Middleton-on-sea","Bognor Regis/Felpham","A","Coastal West Sussex","Bognor Regis and Littlehampton",19585,19635,19660,19650,19765,19785,19715,19595,19835,20120,800,785,770,780,785,795,840,815,905,970,0.91389913899138986,4.3050430504305043E-2,2.4600246002460024E-2,1.3530135301353014E-2,2.4600246002460025E-3,2.4600246002460025E-3,8.6100861008610086E-2,1660,0.68471720818291215,6.3778580024067388E-2,0.25150421179302046,140,159,169,163,155,10,9,9,9,6,13,8.387096774193549E-2,4.9668328719835564E-2,0.13820112955793193,17,250,266,117,0.12501869560446638,1883,3273,1896,1082,0,244,431,139,105,115,95,430,125,0.29069767441860467,47,5,294,3.4154275092936802E-2,130,140,150,170,325,0.13775000000000001,350,0.11091666666666668,355,0.12124999999999998,345,0.1205,395,0.11575000000000002,390,0.13287904599659284,178,6,172,0.95942668442668444,68,81,0.43205756661639017,0.49128645047762698,0.32533233499934777,0.46993795371504055,0.39778405133173356,0.54534658442226325,149,10,6.7114093959731544E-2,3.6860340607094678E-2,0.11912782519982631,"No Sig diff",179,16,8.9385474860335198E-2,5.5768700800059426E-2,0.14025609057858804,"No Sig diff",138,15,0.10869565217391304,6.6985397787695536E-2,0.17160111353318763,"No Sig diff",191,18,9.4240837696335081E-2,6.0444414831651493E-2,0.14403700848472206,"No Sig diff",175,22,0.12571428571428572,8.4504753621622061E-2,0.18300289888897292,"Sig better than Eng.",136,24,0.17647058823529413,0.12155217401413997,0.24916377287229574,"No Sig diff",155,19,0.12258064516129032,7.9896668098098103E-2,0.18351981731662126,"Sig better than Eng.",164,23,0.1402439024390244,9.5303919572450629E-2,0.20165166679396676,"No Sig diff",190,81,0.4263157894736842,0.35814185509394658,0.49741020187906476,190,33,38,22.763157894736842,0.31020733652312599,198,99,0.5,0.43102163323431003,0.56897836676569002,198,33.5,39,22.179487179487182,0.33792575583620349,2287,2241,46,33,13,0.71739130434782605,0.28260869565217389,0.88842592592592595,0.11157407407407409,6.3644792722440502E-2,0.19880765197250103,0.88981481481481473,0.11018518518518521,6.3644792722440502E-2,0.19880765197250103,0.88796296296296306,0.11203703703703703,6.3644792722440502E-2,0.19880765197250103,0.77314814814814803,0.22685185185185186,0.1733308743374927,0.35331770957120112,41,39,39,40,40,51,50,51,50,51,51,50,51,58,57,56,53,56,56,53,55,54,57,22,2.7060270602706028E-2,1298,1163,135,0.10400616332819723]
["Findon",null,"Worthing","Worthing","Worthing","CCC","Findon, Broadwater, Offington, Salvington","Worthing","B","Coastal West Sussex","East Worthing and Shoreham",20260,20380,20385,20465,20610,20715,20880,21010,21080,21065,990,980,975,970,1010,970,1000,1030,1000,970,0.90761904761904766,2.6666666666666668E-2,5.3333333333333337E-2,9.5238095238095247E-3,9.5238095238095238E-4,1.9047619047619048E-3,9.2380952380952383E-2,2130,0.784037558685446,3.5680751173708919E-2,0.18028169014084508,189,158,178,153,160,4,8,7,3,5,7,4.3749999999999997E-2,2.1351611551534529E-2,8.7543041542463937E-2,13,329,333,143,0.1346246371384921,2320,4068,2557,1588,2,322,476,169,100,90,45,371,99,0.26684636118598382,34,8,215,2.387827632163483E-2,115,115,110,85,285,7.3857142857142857E-2,250,7.3428571428571426E-2,285,8.1500000000000003E-2,255,7.3785714285714274E-2,260,8.4642857142857145E-2,255,7.5667655786350152E-2,170,8,162,0.95496987256441046,58,84,0.40838999935638592,0.5585264875180842,0.28827262158110739,0.43435427058587606,0.44204148501870449,0.59413761600299331,149,12,8.0536912751677847E-2,4.6668847532353522E-2,0.13549022786194978,"No Sig diff",195,12,6.1538461538461542E-2,3.5549562909461881E-2,0.10446881648595506,"No Sig diff",178,11,6.1797752808988762E-2,3.4853872292265949E-2,0.1072559578217525,"No Sig diff",217,25,0.1152073732718894,7.9263660950678702E-2,0.16453774802483956,"No Sig diff",202,26,0.12871287128712872,8.9372024897603541E-2,0.18191180266862503,"Sig better than Eng.",198,24,0.12121212121212122,8.2822315097491175E-2,0.17402015484693928,"Sig better than Eng.",168,21,0.125,8.3230069008517427E-2,0.18353593225388359,"Sig better than Eng.",171,29,0.16959064327485379,0.12075302396653985,0.23294717527576139,"No Sig diff",231,132,0.5714285714285714,0.50695673142312703,0.63356360159522707,231,34,46,24.978260869565222,0.26534526854219936,203,123,0.60591133004926112,0.53732196053928849,0.6705667298865301,203,34,40,25.949999999999996,0.23676470588235307,2959,2944,15,13,2,0.8666666666666667,0.13333333333333333,null,0.12328767123287671,6.6236761640452516E-2,0.21800510734717918,null,9.5890410958904104E-2,4.7228354329351081E-2,0.18495837785738112,null,0.1095890410958904,5.6586041610119112E-2,0.20162825897706282,null,0.19444444444444445,0.11951371043417636,0.30032975278389923,40,39,37,40,40,51,49,48,49,48,48,49,49,55,51,50,50,52,52,49,53,50,52,18,1.7142857142857144E-2,1644,1493,151,9.1849148418491483E-2]
["Footprints (Crescent and Lyndhurst)",null,"Worthing","Worthing","Worthing","CCC","Central, Heene, Selden","Worthing","B","Coastal West Sussex","East Worthing and Shoreham",23280,23505,23940,24325,24680,24925,25605,26230,26505,26715,1165,1230,1310,1420,1490,1510,1600,1685,1730,1725,0.76271186440677963,5.5084745762711863E-2,7.8087167070217914E-2,8.4140435835351093E-2,1.2711864406779662E-2,7.2639225181598066E-3,0.23728813559322035,2740,0.49069003285870755,0.14603870025556773,0.3632712668857247,329,338,395,376,335,17,25,19,21,16,23,6.8656716417910449E-2,4.6181975108283008E-2,0.10091176895173444,30,673,453,177,0.11220050150894859,2659,4378,2528,1469,3,311,538,207,245,215,195,763,300,0.39318479685452162,94,1,954,7.3577047663118927E-2,320,315,310,340,690,0.20273333333333335,720,0.17546666666666672,740,0.19153333333333336,640,0.17419999999999999,705,0.16993333333333335,590,0.14603960396039603,345,15,330,0.95079867129533424,149,198,0.44137272070529121,0.60952388106850341,0.39868699754486908,0.50545916039350647,0.54628440930361477,0.65141413994848563,161,13,8.0745341614906832E-2,4.7793188465854376E-2,0.13323808263660591,"No Sig diff",213,28,0.13145539906103287,9.2538847220180187E-2,0.18342986810827064,"No Sig diff",221,18,8.1447963800904979E-2,5.2138724552875479E-2,0.12505928434488195,"No Sig diff",259,21,8.1081081081081086E-2,5.3641549235695814E-2,0.12076571142391865,"No Sig diff",152,33,0.21710526315789475,0.15897583021997941,0.28918128630862894,"No Sig diff",156,39,0.25,0.18861184195741063,0.32340462376129686,"No Sig diff",148,19,0.12837837837837837,8.3749542616648201E-2,0.19181063143373209,"No Sig diff",154,22,0.14285714285714285,9.6271191632122291E-2,0.20682698788382736,"No Sig diff",287,148,0.51567944250871078,0.45803701743184799,0.57290767675478294,287,34,57,26.05263157894737,0.2337461300309597,281,171,0.60854092526690395,0.55037759347384574,0.66377662499053558,281,34,56,27.053571428571423,0.20430672268907579,2914,2738,176,144,32,0.81818181818181823,0.18181818181818182,0.85523886335006882,0.14476113664993123,0.10589945678565693,0.19796894649729968,0.9014757716031061,9.852422839689394E-2,6.877515560848059E-2,0.14807679808484558,0.90265936870775587,9.7340631292244212E-2,6.877515560848059E-2,0.14807679808484558,0.76029450914425445,0.2397054908557455,0.19288785338762213,0.30458113826424538,74,72,72,74,72,85,82,82,81,82,82,81,83,89,82,76,76,75,77,77,82,80,80,23,1.3990267639902677E-2,2494,2125,369,0.14795509222133119]
["HH Rural",null,"Mid Sussex","Mid Sussex","Mid Sussex","Mid Sussex","Cuckfield, Haywards Heath Heath, Haywards Heath Lucastes, High Weald, Linfield","Haywards Heath/Cuckfield","C2","Horsham and Mid Sussex","Mid Sussex",18190,18585,19055,19605,19925,20205,20375,20565,20850,21065,1015,1105,1200,1320,1365,1365,1320,1305,1385,1420,0.89266817838246415,4.1572184429327287E-2,3.3257747543461828E-2,2.5699168556311415E-2,6.8027210884353739E-3,0,0.10733182161753591,2610,0.78024502297090348,7.2358346094946402E-2,0.14739663093415006,230,212,237,258,230,4,5,3,3,3,8,3.4782608695652174E-2,1.7728315594474731E-2,6.7121731615965546E-2,5,347,472,203,0.14428556510470478,2468,4544,2646,1671,1,365,438,171,50,60,45,304,73,0.24013157894736842,32,10,153,1.7888460189407224E-2,50,75,80,66,200,5.5E-2,195,4.2428571428571434E-2,200,5.1071428571428566E-2,160,4.8785714285714279E-2,210,5.0499999999999996E-2,205,5.2295918367346941E-2,247,8,239,0.89712698548558967,130,168,0.51632972644659469,0.66402832692714997,0.48058990740273499,0.60588621530441222,0.64215388951563079,0.75728343917928798,194,7,3.608247422680412E-2,1.758630667851303E-2,7.2594279974277642E-2,"Sig better than Eng.",208,7,3.3653846153846152E-2,1.6395766201128759E-2,6.782504175599266E-2,"Sig better than Eng.",226,10,4.4247787610619468E-2,2.4209353106802618E-2,7.9520665589665557E-2,"Sig better than Eng.",234,9,3.8461538461538464E-2,2.0364448140159225E-2,7.1467560160631355E-2,"Sig better than Eng.",165,20,0.12121212121212122,7.9852303583502038E-2,0.17980820353905713,"Sig better than Eng.",144,14,9.7222222222222224E-2,5.8799052664080885E-2,0.15657665503447649,"Sig better than Eng.",168,17,0.10119047619047619,6.4142045214917287E-2,0.15606941644509648,"Sig better than Eng.",157,14,8.9171974522292988E-2,5.3860798787169005E-2,0.14410718194465799,"Sig better than Eng.",272,163,0.59926470588235292,0.54003535664635594,0.6557292692763258,272,34,54,27.407407407407408,0.19389978213507622,291,187,0.6426116838487973,0.58602068090959913,0.69548654108008678,291,34,58,28.379310344827584,0.16531440162271813,3289,3245,44,36,8,0.81818181818181823,0.18181818181818182,0.88936076994900526,3.9210658622423331E-2,2.1261640780226743E-2,8.0052890963794948E-2,0.91070530776413128,1.7866120807297277E-2,8.1306524115839253E-3,5.2334539866256941E-2,0.89753070458952811,3.1040723981900449E-2,1.4399085841634563E-2,6.6490776169296717E-2,0.82585191769015309,0.10271951088127559,7.6896904231561619E-2,0.16739031564409299,72,69,70,70,70,69,66,65,64,66,66,63,68,86,81,77,73,77,76,75,83,80,79,20,1.5117157974300832E-2,2067,1975,92,4.450895016932753E-2]
["HH Urban",null,"Mid Sussex","Mid Sussex","Mid Sussex","Mid Sussex","Haywards Heath Ashenground, Haywards Heath Brentswood, Haywards Heath Franklands, Haywards Heath Heath","Haywards Heath/Cuckfield","C2","Horsham and Mid Sussex","Mid Sussex",16860,17050,17235,17490,17540,17695,17985,18150,18425,18995,1095,1100,1120,1200,1220,1205,1225,1230,1245,1320,0.80475799835931094,4.2657916324856437E-2,5.0861361771944218E-2,9.5980311730926984E-2,5.742411812961444E-3,0,0.19524200164068908,2250,0.604982206405694,0.20862989323843417,0.18638790035587188,243,242,260,236,254,11,9,6,9,11,13,5.1181102362204724E-2,3.0151261764165438E-2,8.5584426969453661E-2,21,382,376,179,0.14581754480108117,2212,3909,2175,1420,1,260,376,118,100,95,95,384,122,0.31770833333333331,26,7,248,3.1746031746031744E-2,165,130,155,145,405,0.11745454545454544,410,0.11699999999999998,455,0.12945454545454546,420,0.11809090909090911,430,0.11572727272727272,370,0.10914454277286136,237,2,235,0.99147727272727271,107,138,0.46357004386608791,0.59349185514040581,0.39287546928976086,0.51920014902798606,0.52337579384151411,0.64828609420478922,177,8,4.519774011299435E-2,2.3077636816594912E-2,8.663978611332683E-2,"Sig better than Eng.",178,12,6.741573033707865E-2,3.898189964215943E-2,0.11412652239347418,"No Sig diff",204,11,5.3921568627450983E-2,3.0372420984158512E-2,9.3960130217705773E-2,"Sig better than Eng.",197,17,8.6294416243654817E-2,5.4574988236147239E-2,0.13383959032194798,"No Sig diff",147,25,0.17006802721088435,0.11793015070055879,0.23901056865893572,"No Sig diff",165,29,0.17575757575757575,0.12525193987760452,0.24101745421930615,"No Sig diff",149,32,0.21476510067114093,0.15643634438513321,0.28743182688299307,"No Sig diff",143,20,0.13986013986013987,9.2396955251221199E-2,0.2061662650599326,"No Sig diff",228,130,0.57017543859649122,0.50527816193920483,0.63274719453833861,228,34,45,23.866666666666671,0.29803921568627439,247,141,0.57085020242914974,0.50850446183921483,0.63102590193936048,247,34,49,24.959183673469393,0.26590636254501782,2747,2657,90,75,15,0.83333333333333337,0.16666666666666666,0.90808540874330357,9.1914591256696501E-2,6.7227027172261908E-2,0.1593496190820943,0.95988835725677835,4.0111642743221688E-2,2.3753540562369307E-2,8.9084377199980441E-2,0.91131967447756923,8.8680325522430783E-2,5.8070662732992634E-2,0.14575823782296227,0.83214431767063357,0.16785568232936654,0.12997636711378782,0.24446062618017678,65,63,63,64,63,74,65,66,64,66,71,66,67,72,68,67,63,66,66,63,69,69,68,26,2.1346469622331693E-2,1900,1785,115,6.0526315789473685E-2]
["Horsham Nursery School",null,"Horsham","Horsham Town","Horsham","Horsham","Forest, Holbrook East, Horsham Park, Roffey North, Roffey South","Horsham E","C3","Horsham and Mid Sussex","Horsham",16890,17035,17080,17315,17440,17640,17925,18020,18165,18135,985,970,935,955,1005,1025,1095,1110,1155,1095,0.83729433272394882,4.3875685557586835E-2,6.2157221206581355E-2,4.3875685557586835E-2,7.3126142595978062E-3,5.4844606946983544E-3,0.16270566727605118,2085,0.66314779270633395,0.16794625719769674,0.16890595009596929,203,201,193,194,199,6,6,3,6,3,11,5.5276381909547742E-2,3.1142457209597071E-2,9.625486565987218E-2,9,298,371,148,0.15448969415237962,2199,3972,2190,1385,5,246,405,149,80,105,70,375,107,0.28533333333333333,35,7,286,3.7725893681572351E-2,150,145,135,125,345,9.7272727272727275E-2,340,8.827272727272728E-2,350,0.10281818181818182,305,9.7727272727272746E-2,335,0.10109090909090908,335,0.10105580693815988,198,8,190,0.95203417272382795,93,115,0.51884419876961396,0.62537395540632246,0.41930894701947735,0.56005564757734805,0.53433430731905218,0.67201974671269327,161,11,6.8322981366459631E-2,3.8575583671797267E-2,0.11818994731518039,"No Sig diff",168,11,6.5476190476190479E-2,3.695089521739349E-2,0.11342875703903946,"No Sig diff",115,6,5.2173913043478258E-2,2.4128549061825513E-2,0.10917054519277661,"No Sig diff",172,14,8.1395348837209308E-2,4.910271749221258E-2,0.13197777987310397,"No Sig diff",181,18,9.9447513812154692E-2,6.3834231714869225E-2,0.15170972187047022,"Sig better than Eng.",172,27,0.15697674418604651,0.11018266234093407,0.21875830077786704,"No Sig diff",196,24,0.12244897959183673,8.3682204688779863E-2,0.1757307275757328,"Sig better than Eng.",178,26,0.14606741573033707,0.10167044863273805,0.20541826030550761,"No Sig diff",197,96,0.48730964467005078,0.41842434381975807,0.55668039785380308,197,34,39,24.076923076923077,0.29185520361990952,215,140,0.65116279069767447,0.58530853616604794,0.71171013822168405,215,34,43,24.232558139534884,0.28727770177838574,2770,2686,84,74,10,0.88095238095238093,0.11904761904761904,0.90972777222777235,9.0272227772227778E-2,4.2986910653413021E-2,0.13784827338561564,0.88209429459429456,0.11790570540570541,6.6278187495025204E-2,0.1752358718003717,0.87754884004884015,0.12245115995115995,6.6278187495025204E-2,0.1752358718003717,0.77176874162520082,0.22823125837479907,0.16395460040058435,0.30869018535562776,58,56,57,58,56,68,66,62,65,63,65,65,66,56,52,49,48,48,51,46,52,49,51,19,1.736745886654479E-2,1659,1527,132,7.956600361663653E-2]
["Kingston Buci",null,"Adur","Adur East","Adur","Adur","Buckingham, St Mary's, St Nicolas, Southlands","Shoreham","B","Coastal West Sussex","East Worthing and Shoreham",14170,14160,14375,14435,14450,14610,14625,14590,14850,15185,770,775,805,800,830,815,860,905,945,990,0.89910313901345296,2.1300448430493273E-2,4.708520179372197E-2,2.8026905829596414E-2,0,4.4843049327354259E-3,0.10089686098654709,1660,0.59975889089813139,0.20253164556962025,0.19770946353224833,150,168,169,178,202,7,5,7,4,6,16,7.9207920792079209E-2,4.9341090217535556E-2,0.12478058102419014,9,299,296,106,0.10826011162237827,1701,2930,1708,897,3,278,406,124,135,105,95,405,156,0.38518518518518519,30,3,345,5.3889409559512651E-2,165,165,155,155,415,0.16354545454545455,425,0.15463636363636366,420,0.15981818181818183,420,0.1598181818181818,445,0.15672727272727272,435,0.16322701688555347,181,5,176,0.97242984471245353,73,95,0.42210762312085143,0.5499432456088803,0.34456265326077334,0.48862388422554792,0.4660727025222357,0.61177357998414772,128,6,4.6875E-2,2.1657844171923776E-2,9.8497522450943217E-2,"No Sig diff",156,9,5.7692307692307696E-2,3.0645742163795515E-2,0.10599877410776384,"No Sig diff",132,9,6.8181818181818177E-2,3.6282334854811568E-2,0.12450406283489571,"No Sig diff",165,17,0.10303030303030303,6.5326799711821093E-2,0.15879741175262088,"No Sig diff",135,25,0.18518518518518517,0.12869783265528051,0.25909310009649444,"No Sig diff",120,27,0.22500000000000001,0.15949154668383531,0.30756899484645162,"No Sig diff",121,18,0.1487603305785124,9.6217408704644847E-2,0.22291903200226135,"No Sig diff",125,27,0.216,0.15290810140879452,0.2960270422175349,"No Sig diff",179,88,0.49162011173184356,0.41933238292420277,0.56425995975699406,179,34,35,23.971428571428568,0.29495798319327743,172,106,0.61627906976744184,0.5418179440123243,0.6856596956084211,172,34,34,26.941176470588232,0.20761245674740494,2048,2022,26,22,4,0.84615384615384615,0.15384615384615385,0.92550505050505061,7.4494949494949489E-2,4.283011146065737E-2,0.15590067811002259,0.9412878787878789,5.8712121212121209E-2,2.8956279687604513E-2,0.12971104936160943,0.93118686868686884,6.8813131313131312E-2,3.5767126237989492E-2,0.14293193307195745,0.79608585858585845,0.20391414141414141,0.14776236248775229,0.31138092047245669,57,52,53,55,53,42,40,41,40,41,41,40,41,41,38,37,37,37,38,36,37,36,38,22,2.4663677130044841E-2,1387,1218,169,0.12184571016582552]
["Lancing",null,"Adur","Adur West","Adur","Adur","Marine, Mash Barn, Widewater","Lancing","B","Coastal West Sussex","East Worthing and Shoreham",13875,13885,14085,14295,14475,14595,14705,14760,14890,15055,680,650,690,730,725,805,850,875,910,955,0.88173302107728335,3.864168618266979E-2,4.6838407494145202E-2,1.9906323185011711E-2,5.8548009367681503E-3,7.0257611241217799E-3,0.11826697892271663,1580,0.6198608475648324,0.12397216951296648,0.25616698292220114,180,169,185,195,199,11,12,7,13,8,9,4.5226130653266333E-2,2.3973316045364932E-2,8.3704172312679903E-2,14,316,254,103,0.11967164501186521,1619,2755,1633,831,0,297,388,117,135,145,140,388,152,0.39175257731958762,44,3,296,4.3929949539922825E-2,190,180,200,175,405,0.17611111111111108,375,0.15288888888888888,460,0.18899999999999997,370,0.15466666666666665,420,0.16600000000000001,405,0.16396761133603238,188,14,174,0.91221703151023581,68,86,0.35166311538860562,0.46023725729608089,0.3214116321508444,0.46491507656072817,0.42089495809986699,0.56785907920074208,130,7,5.3846153846153849E-2,2.632495898818149E-2,0.10697797253915731,"No Sig diff",154,11,7.1428571428571425E-2,4.0349744563473719E-2,0.12336807085566588,"No Sig diff",127,12,9.4488188976377951E-2,5.4879198646489942E-2,0.15790854517443623,"No Sig diff",158,10,6.3291139240506333E-2,3.4738438192433274E-2,0.11257522911149487,"No Sig diff",110,24,0.21818181818181817,0.15122956180325126,0.30415338354662314,"No Sig diff",113,17,0.15044247787610621,9.6100867119634975E-2,0.22776926598753502,"No Sig diff",98,16,0.16326530612244897,0.10306803521803502,0.24886583568023959,"No Sig diff",126,11,8.7301587301587297E-2,4.9446843632529658E-2,0.14957632705118967,"Sig better than Eng.",171,83,0.4853801169590643,0.41161906981424612,0.55978359386904153,171,34,34,22.558823529411764,0.33650519031141868,169,90,0.53254437869822491,0.45743480329711905,0.60620733485106337,169,34,33,22.090909090909093,0.35026737967914429,1894,1869,25,20,5,0.8,0.2,0.84947089947089938,0.15052910052910054,8.5202569718038565E-2,0.21470101193978974,0.87645502645502649,0.12354497354497355,7.1039064247299846E-2,0.19341659749446916,0.8838624338624339,0.11613756613756615,7.1039064247299846E-2,0.19341659749446916,0.71941659704817595,0.28058340295182405,0.16829549205620981,0.3265716491399448,53,51,51,52,51,58,54,56,52,55,57,55,56,37,34,33,33,33,33,33,35,34,34,12,1.405152224824356E-2,1322,1162,160,0.12102874432677761]
["Langley Green",null,"Crawley","Crawley","Crawley","Crawley","Ifield, Langley Green","Crawley NW","C1","Crawley","Crawley",15625,15845,16080,16165,16350,16480,16875,17185,17290,17405,935,940,970,1025,1100,1170,1285,1305,1330,1310,0.57689364957918898,5.9678653404743688E-2,7.1155317521040554E-2,0.24483550114766642,3.8255547054322873E-2,9.181331293037491E-3,0.42310635042081102,2405,0.44675540765391014,0.38019966722129783,0.17304492512479203,278,290,295,260,242,16,8,11,12,8,20,8.2644628099173556E-2,5.4134868300491863E-2,0.12419737488990565,25,379,343,285,0.19692138070707646,2149,3986,2183,1076,1,300,546,260,200,185,160,523,219,0.41873804971319312,47,3,382,5.8276125095347062E-2,280,300,300,280,780,0.23018181818181818,810,0.21772727272727277,750,0.22318181818181818,705,0.23072727272727275,725,0.21154545454545454,735,0.19573901464713714,243,9,234,0.96748431604046592,83,121,0.36981045743336588,0.52300648035510899,0.29619960630889919,0.41789582527245578,0.45330934839463238,0.58032648318403168,182,13,7.1428571428571425E-2,4.2215244868037641E-2,0.11835957525047065,"No Sig diff",199,23,0.11557788944723618,7.8261508207020325E-2,0.16745482173099549,"No Sig diff",164,16,9.7560975609756101E-2,6.0946967227705207E-2,0.15259657006354138,"No Sig diff",175,13,7.4285714285714288E-2,4.3924003825929425E-2,0.12293584521283889,"No Sig diff",171,34,0.19883040935672514,0.14591834770221057,0.26497652417351536,"No Sig diff",175,32,0.18285714285714286,0.13260870016222265,0.24672984509484641,"No Sig diff",188,36,0.19148936170212766,0.14164627861962834,0.25368776067987386,"No Sig diff",173,38,0.21965317919075145,0.16442041037655816,0.28706567978088754,"No Sig diff",213,77,0.36150234741784038,0.29996303420485582,0.42794877601411613,213,32,42,22.095238095238102,0.30952380952380931,276,140,0.50724637681159424,0.44857125889871413,0.56572254880532213,276,34,55,22.472727272727269,0.33903743315508034,2421,2397,24,18,6,0.75,0.25,0.89145702782066427,0.1085429721793358,6.5066148885121536E-2,0.16697738327579825,0.94403778040141684,5.5962219598583232E-2,2.8820370601525466E-2,0.10722860307950929,0.88092210819483541,0.1190778918051645,7.6104144741722793E-2,0.18336640412773555,0.72868041049859233,0.27131958950140767,0.20122466904115702,0.34756778676870415,73,71,70,72,71,56,55,53,55,54,53,56,56,66,64,60,64,59,61,64,65,63,60,26,1.9892884468247895E-2,2123,1864,259,0.12199717381064532]
["Littlehampton",null,"Arun East","Arun East","Arun","Arun","Beach, Brookfield, Ham, River, Wick with Toddington","Littlehampton","B","Coastal West Sussex","Bognor Regis and Littlehampton",18555,18535,18740,18880,19110,19395,19645,19930,20235,20490,960,995,1000,1025,1065,1165,1225,1320,1410,1430,0.83437499999999998,7.5781249999999994E-2,4.6093750000000003E-2,3.4375000000000003E-2,4.6874999999999998E-3,4.6874999999999998E-3,0.16562499999999999,2345,0.4166311300639659,0.2298507462686567,0.35351812366737739,268,267,297,321,285,30,20,31,19,17,18,6.3157894736842107E-2,4.0320286324222479E-2,9.7615102118150499E-2,35,464,346,223,0.15733980667725542,2358,4123,2370,1004,2,421,698,245,300,285,235,697,280,0.40172166427546629,56,1,653,7.3927318012000448E-2,380,445,420,390,1070,0.28491666666666665,1035,0.25833333333333336,1095,0.28950000000000004,970,0.26874999999999999,1030,0.27366666666666667,1010,0.25602027883396705,282,14,268,0.9510487396272832,87,115,0.31667658923114633,0.42742557459181335,0.2713876119009872,0.38282278121029534,0.37125981974450212,0.48895289236431427,155,7,4.5161290322580643E-2,2.2045753492620307E-2,9.0276677648195372E-2,"Sig better than Eng.",201,20,9.950248756218906E-2,6.5338926232430275E-2,0.14868737036346685,"No Sig diff",151,12,7.9470198675496692E-2,4.604266587121892E-2,0.13376356324041994,"No Sig diff",218,21,9.6330275229357804E-2,6.3870955682172159E-2,0.14276967436230478,"No Sig diff",168,28,0.16666666666666666,0.11790131485380641,0.23033513071277231,"No Sig diff",185,34,0.18378378378378379,0.13460281913919561,0.2458298425725948,"No Sig diff",192,57,0.296875,0.23674735383073847,0.36497129925888039,"Sig worse than Eng.",188,39,0.20744680851063829,0.15562878542840139,0.27098107942457483,"No Sig diff",250,132,0.52800000000000002,0.46616258903849139,0.58898994618976364,250,34,50,22.36,0.34235294117647058,253,137,0.54150197628458496,0.47994063804216835,0.6018218628267451,253,34,50,24.740000000000006,0.27235294117647041,2884,2719,165,134,31,0.81212121212121213,0.18787878787878787,0.83216741591741583,0.16783258408258406,0.13481123375916229,0.24417148861634683,0.84033272283272276,0.15966727716727719,0.12060131558197143,0.22580925295913523,0.81671092796092803,0.18328907203907199,0.14772594103731715,0.2599586367030608,0.6699114774114775,0.33008852258852261,0.27049843060050693,0.40270685367004644,93,90,90,92,90,66,56,60,58,60,64,57,61,50,45,41,41,41,41,41,44,40,45,17,1.328125E-2,2075,1726,349,0.16819277108433736]
["Maidenbower and Pound Hill",null,"Crawley","Crawley","Crawley","Crawley","Maidenbower, Pound Hill North, Pound Hill South and Worth","Crawley SE","C1","Crawley","Crawley",22545,22820,22870,23175,23725,24090,24460,24445,24605,24745,1565,1550,1525,1580,1705,1710,1820,1840,1825,1825,0.7443897099069513,4.3787629994526546E-2,6.7870826491516142E-2,0.10509031198686371,3.1746031746031744E-2,7.1154898741105635E-3,0.2556102900930487,3425,0.67952088810984512,0.12795793163891322,0.1925211802512416,316,353,351,329,332,6,11,9,5,8,23,6.9277108433734941E-2,4.6603311300102486E-2,0.10180438974941115,10,664,570,221,0.13170795051194636,3454,5931,3289,2085,1,390,537,276,140,130,110,602,174,0.28903654485049834,48,9,211,2.1561414265276926E-2,220,200,185,170,445,0.08,485,8.257142857142856E-2,450,9.1642857142857151E-2,405,9.6857142857142864E-2,365,8.7357142857142842E-2,410,8.0313418217433888E-2,337,7,330,0.98116732804232809,122,194,0.37347750194862989,0.58998427864520797,0.31939213882089795,0.4230006606384864,0.53405685232247369,0.63967823641422061,267,21,7.9000000000000001E-2,5.1999999999999998E-2,0.11700000000000001,"No Sig diff",276,23,8.3000000000000004E-2,5.6000000000000001E-2,0.122,"No Sig diff",239,10,4.1841004184100417E-2,2.2883426077391942E-2,7.5293627118033973E-2,"Sig better than Eng.",265,23,8.6792452830188674E-2,5.8529585664442121E-2,0.1268639136839462,"No Sig diff",252,37,0.14699999999999999,0.108,0.19600000000000001,"No Sig diff",282,34,0.121,8.7999999999999995E-2,0.16400000000000001,"Sig better than Eng.",263,38,0.14448669201520911,0.10711124264128175,0.1920981050123905,"No Sig diff",249,34,0.13654618473895583,9.9385816160059939E-2,0.1847505717400014,"Sig better than Eng.",324,210,0.64814814814814814,0.5946899178918934,0.69813454776699435,324,34,64,26.765625000000004,0.21277573529411753,330,227,0.68787878787878787,0.63596542157199598,0.73546837349358407,330,34,66,24.878787878787882,0.26827094474153285,2918,2877,41,31,10,0.75609756097560976,0.24390243902439024,0.94883774022429479,5.1162259775705154E-2,3.5005301144816203E-2,0.10293256696562286,0.98154979940694231,1.8450200593057735E-2,1.0833366500687466E-2,5.7743180653120271E-2,0.94172540811196281,5.8274591888037262E-2,3.8966557352548399E-2,0.10961620637767483,0.85018930649182767,0.14981069350817247,0.10020126624456825,0.19775294244526492,97,96,96,96,96,83,80,82,80,82,82,77,82,96,91,90,88,90,93,83,88,84,92,25,1.3683634373289545E-2,2936,2702,234,7.970027247956403E-2]
["Maybridge",null,"Worthing","Worthing","Worthing","CCC","Ferring, Castle, Goring","Durrington","B","Coastal West Sussex","Worthing West",20310,20305,20430,20645,20655,20545,20560,20555,20615,20695,925,915,910,865,915,930,910,900,900,900,0.87982359426681367,1.9845644983461964E-2,4.8511576626240352E-2,4.6306504961411248E-2,4.410143329658214E-3,1.1025358324145535E-3,0.12017640573318633,1815,0.6644628099173554,0.13829201101928373,0.19724517906336089,172,165,168,172,164,12,12,7,9,6,1,6.0975609756097563E-3,1.0771813904626609E-3,3.3726250739703603E-2,17,272,292,145,0.14277798694365315,2003,3568,2418,1461,1,289,506,161,120,125,110,417,138,0.33093525179856115,42,5,340,3.6135614836858329E-2,165,155,155,140,455,0.12730769230769229,505,0.1353076923076923,490,0.13253846153846155,505,0.13207692307692306,475,0.11769230769230769,440,0.14170692431561996,178,11,167,0.94481551272722752,65,80,0.39992320616052868,0.50120928204092507,0.3185563025613693,0.46486881169651639,0.40460039183736535,0.5544259811303428,120,6,0.05,2.3114364414465797E-2,0.10480288536236734,"No Sig diff",159,8,5.0314465408805034E-2,2.5712676114661916E-2,9.6132577326242794E-2,"No Sig diff",154,12,7.792207792207792E-2,4.513428609205352E-2,0.13125447151770517,"No Sig diff",200,13,6.5000000000000002E-2,3.8376354649152976E-2,0.10801907929906893,"No Sig diff",163,19,0.1165644171779141,7.5906003798999769E-2,0.17487973684632438,"Sig better than Eng.",160,24,0.15,0.10291845645016234,0.21349388016989129,"No Sig diff",175,21,0.12,7.984170687522997E-2,0.17648285636071756,"Sig better than Eng.",183,38,0.20765027322404372,0.15518964041562014,0.27213232187603303,"No Sig diff",214,116,0.54205607476635509,0.47514868075029232,0.60748021871377078,214,34,42,24.166666666666668,0.28921568627450978,197,114,0.57868020304568524,0.50887036539732466,0.64548023622659589,197,34,39,22.820512820512818,0.32880844645550539,2557,2503,54,46,8,0.85185185185185186,0.14814814814814814,0.84306526806526816,0.15693473193473192,0.1071850142576424,0.29145419217519991,0.86614219114219115,0.13385780885780885,7.3432373433468923E-2,0.23929814820406517,0.84114219114219102,0.15885780885780887,0.10888765378062988,0.2955422258270492,0.80011655011655014,0.19988344988344989,0.14513708450988849,0.34644939808203273,46,43,43,45,44,52,51,50,51,50,52,51,51,53,50,48,44,48,49,48,50,48,50,25,2.7563395810363836E-2,1438,1280,158,0.10987482614742698]
["Mid Sussex Rural (North)",null,"Mid Sussex","Mid Sussex","Mid Sussex","Mid Sussex","Ardingly and Balcombe, Bolney, Crawley Down and Turners Hill, East Grinstead Herontye","Haywards Heath/Cuckfield","C2","Horsham and Mid Sussex","Mid Sussex",23535,23530,23810,24125,24555,24770,25010,25180,25165,25335,1215,1180,1200,1260,1290,1300,1280,1265,1230,1220,0.90383111806098515,5.0039093041438623E-2,3.4401876465989051E-2,9.3823299452697427E-3,2.3455824863174357E-3,0,9.616888193901485E-2,2740,0.72023374726077427,8.8020452885317749E-2,0.19174579985390797,215,227,201,208,187,6,3,7,5,3,12,6.4171122994652413E-2,3.7086220493424561E-2,0.10880167510714658,8,356,433,209,0.16072889011779584,2911,5302,2948,1976,2,342,453,175,80,60,60,379,91,0.24010554089709762,49,10,165,1.7013817281913798E-2,70,105,100,95,250,5.2600000000000001E-2,270,5.1533333333333348E-2,270,6.1333333333333344E-2,215,6.2000000000000013E-2,220,6.0333333333333343E-2,245,5.9178743961352656E-2,187,5,182,0.97033475783475776,95,118,0.55904556457188048,0.68774524695577322,0.44970404802433445,0.59334336439570501,0.57656597835294798,0.71400405548231827,181,12,6.6000000000000003E-2,3.7999999999999999E-2,0.112,"No Sig diff",207,18,8.6999999999999994E-2,5.6000000000000001E-2,0.13300000000000001,"No Sig diff",189,9,4.7619047619047616E-2,2.5251906693033909E-2,8.8009312934030443E-2,"Sig better than Eng.",190,15,7.8947368421052627E-2,4.8424492181179869E-2,0.12615869052174186,"No Sig diff",175,23,0.13100000000000001,8.8999999999999996E-2,0.189,"No Sig diff",189,21,0.111,7.3999999999999996E-2,0.16400000000000001,"Sig better than Eng.",183,28,0.15300546448087432,0.10803050767038307,0.21224883075055107,"No Sig diff",174,14,8.0459770114942528E-2,4.8531099813854901E-2,0.13051297141589011,"Sig better than Eng.",238,133,0.55882352941176472,0.49530353405154642,0.62047479500972391,238,34,47,25.106382978723406,0.26157697121401746,203,114,0.56157635467980294,0.49280222994584766,0.62806328774358189,203,34,40,23.924999999999997,0.29632352941176476,4108,4023,85,80,5,0.94117647058823528,5.8823529411764705E-2,0.89808802308802316,0.10191197691197691,5.4673224147554787E-2,0.15135598293107455,0.93512506012506003,6.4874939874939877E-2,3.3940885823589673E-2,0.11685557044311824,0.92475468975468966,7.5245310245310254E-2,4.411767148383796E-2,0.13429516018883067,0.84827894327894338,0.15172105672105671,0.12307779859865452,0.24864966091573915,41,37,37,37,37,58,54,56,55,56,56,55,56,61,57,57,56,58,58,54,57,57,58,33,2.5923016496465043E-2,2076,1949,127,6.1175337186897882E-2]
["Midhurst",null,"Chichester","Chichester Rural","Chichester","Arch","Easebourne, Fernhurst, Harting, Midhurst, Rogate, Stedham","Midhurst/Petworth","A","Coastal West Sussex","Chichester",15945,15990,15980,16045,16120,16080,16020,16095,16150,16255,755,770,810,830,830,815,815,790,785,815,0.92874692874692877,1.7199017199017199E-2,4.1769041769041768E-2,7.3710073710073713E-3,1.2285012285012285E-3,3.6855036855036856E-3,7.125307125307126E-2,1650,0.60097028502122496,0.1952698605215282,0.20375985445724681,117,125,99,127,97,4,7,1,5,3,13,0.13402061855670103,8.002456680409932E-2,0.21589993854994483,7,198,277,134,0.13288068869650085,1708,3061,1612,1037,0,188,295,92,70,70,55,308,98,0.31818181818181818,26,6,207,2.8618830360846122E-2,85,95,95,80,250,8.1166666666666665E-2,240,7.4999999999999997E-2,250,7.1749999999999994E-2,270,7.2083333333333333E-2,280,6.7708333333333329E-2,235,8.7850467289719625E-2,138,4,134,0.73487494778613194,67,83,0.42403308238971876,0.51246345359498269,0.41652894110160354,0.58347105889839646,0.53495096670916298,0.69719955969215563,114,10,8.771929824561403E-2,4.8345105411009885E-2,0.15397298415856125,"No Sig diff",133,9,6.7669172932330823E-2,3.6006387177108239E-2,0.12360502744039735,"No Sig diff",141,7,4.9645390070921988E-2,2.4253530324488033E-2,9.8925695885742834E-2,"No Sig diff",123,6,4.878048780487805E-2,2.2545774253251705E-2,0.10234603137544228,"No Sig diff",88,10,0.11363636363636363,6.2908003751013547E-2,0.1966856386718577,"No Sig diff",88,17,0.19318181818181818,0.12425957732106709,0.2877706681323895,"No Sig diff",91,13,0.14285714285714285,8.542758136548774E-2,0.22921813572656949,"No Sig diff",100,6,0.06,2.7786123963188188E-2,0.1247681544589592,"Sig better than Eng.",150,80,0.53333333333333333,0.45366249130807695,0.61133949240071794,150,34,30,25.433333333333334,0.25196078431372548,166,90,0.54216867469879515,0.46628048237198927,0.61614933245184689,166,34,33,25.515151515151519,0.2495543672014259,2265,2068,197,169,28,0.85786802030456855,0.14213197969543148,null,0.15909090909090909,9.71981376163292E-2,0.24950313936490803,null,0.125,7.1252008979545867E-2,0.21011939569981511,null,0.12643678160919541,7.2088787763500334E-2,0.21238000186592054,null,0.29545454545454547,0.21030723719315755,0.39771352899558482,29,27,27,28,27,22,22,22,22,22,22,22,22,39,33,33,33,33,34,33,34,31,33,12,1.4742014742014743E-2,1220,1116,104,8.5245901639344257E-2]
["Northgate",null,"Crawley","Crawley","Crawley","Crawley","Northgate, Three Bridges, West Green","Crawley NE","C1","Crawley","Crawley",14675,14925,15190,15405,15880,16250,17140,17785,18270,18550,795,810,830,825,895,980,1180,1340,1425,1455,0.5143939393939394,7.9545454545454544E-2,8.8636363636363638E-2,0.26212121212121214,3.2575757575757577E-2,2.2727272727272728E-2,0.4856060606060606,2205,0.37431941923774953,0.37749546279491836,0.24818511796733211,199,311,317,298,307,8,13,17,7,9,21,6.8403908794788276E-2,4.517237630442774E-2,0.1023029926332059,20,514,330,171,0.13425414475583303,2102,3595,2365,1231,5,338,561,230,195,175,145,507,211,0.41617357001972388,30,3,422,5.5687516495117446E-2,290,295,235,210,610,0.17241666666666666,635,0.18791666666666665,580,0.19166666666666668,535,0.19466666666666668,475,0.17633333333333334,550,0.17027863777089783,258,8,250,0.88818493037600588,108,155,0.39258947574164954,0.55961337374380848,0.37208205941359102,0.49397614381235777,0.55844423217073813,0.67792364448935216,129,15,0.11627906976744186,7.1745771694535582E-2,0.18300495990027799,"No Sig diff",154,16,0.1038961038961039,6.4968878575839786E-2,0.1621036477963953,"No Sig diff",132,8,6.0606060606060608E-2,3.1026884470063115E-2,0.11503646756507763,"No Sig diff",183,14,7.650273224043716E-2,4.6115353092286537E-2,0.12430431190964095,"No Sig diff",114,23,0.20175438596491227,0.13837064215120354,0.28458286945231603,"No Sig diff",119,17,0.14285714285714285,9.1145398332360461E-2,0.21690580184045349,"No Sig diff",158,28,0.17721518987341772,0.12555026627158597,0.24420331390957831,"No Sig diff",146,35,0.23972602739726026,0.17771801912998342,0.31507923072231259,"No Sig diff",230,112,0.48695652173913045,0.42310710602431456,0.55123448408438924,230,34,46,21.304347826086961,0.3734015345268541,236,118,0.5,0.43672153044647821,0.56327846955352179,236,34,47,20.936170212765962,0.38423028785982466,2552,2532,20,19,1,0.95,0.05,0.82305193716958425,9.3614729497082438E-2,5.5187336060682587E-2,0.14290024916446165,0.83183684507213929,8.4829821594527469E-2,4.6054075596845066E-2,0.12862000846698951,0.81074801560095677,0.1059186510657099,6.927290603446952E-2,0.16393493093263919,0.66120358807858803,0.25546307858807854,0.19418660232856491,0.3260738074282723,67,59,60,65,62,76,72,69,72,70,73,73,74,63,60,55,56,56,59,57,60,59,57,29,2.2137404580152672E-2,2102,1792,310,0.14747859181731685]
["Petworth",null,"Chichester","Chichester Rural","Chichester","Arch","Bury, Fernhurst, Petworth, Plaistow","Midhurst/Petworth","A","Coastal West Sussex","Arundel and South Downs",11195,11265,11190,11230,11395,11450,11565,11620,11600,11620,595,585,580,590,610,605,620,635,630,605,0.92902208201892744,2.8391167192429023E-2,2.996845425867508E-2,4.7318611987381704E-3,6.3091482649842269E-3,1.5772870662460567E-3,7.0977917981072558E-2,1325,0.63903541823662391,0.1680482290881688,0.19291635267520724,99,95,81,61,55,4,5,3,2,4,3,5.4545454545454543E-2,1.8723215554684484E-2,0.14853060544053792,5,168,209,102,0.17248256109179885,1297,2364,1307,905,0,129,202,71,35,40,40,201,60,0.29850746268656714,20,5,104,2.2029231095106967E-2,60,60,50,55,175,8.8124999999999995E-2,200,9.0374999999999997E-2,180,8.9249999999999996E-2,180,9.8250000000000004E-2,175,7.9125000000000001E-2,155,7.5609756097560973E-2,61,0,61,0.75,22,28,0.26822916666666663,0.33784722222222219,0.25173936505814554,0.48608326732600293,0.34012730888289117,0.58276170064185839,83,5,6.0240963855421686E-2,2.6003401041882011E-2,0.13338428093238414,"No Sig diff",89,8,8.98876404494382E-2,4.6252429145950645E-2,0.1674609169467059,"No Sig diff",82,5,6.097560975609756E-2,2.6323955067816089E-2,0.13492049500154024,"No Sig diff",100,7,7.0000000000000007E-2,3.4319261067272677E-2,0.13749514739073496,"No Sig diff",65,13,0.2,0.12077959241205476,0.31270132638165932,"No Sig diff",61,12,0.19672131147540983,0.11627802231427166,0.31309940575507544,"No Sig diff",64,8,0.125,6.4722426633304547E-2,0.22774561821129938,"No Sig diff",63,12,0.19047619047619047,0.11246191872292463,0.30406787149874537,"No Sig diff",121,66,0.54545454545454541,0.45669996779439898,0.63141178693764843,121,35,24,25.541666666666664,0.27023809523809533,114,69,0.60526315789473684,0.51351296049528616,0.6901505059975892,114,34,22,24.863636363636363,0.26871657754010697,2014,1726,288,243,45,0.84375,0.15625,null,0.1111111111111111,4.4065689087418335E-2,0.25315129015036325,null,5.5555555555555552E-2,1.5369663767066871E-2,0.18144974107611211,null,8.3333333333333329E-2,2.8748089271291792E-2,0.21827010276918851,null,0.14285714285714285,6.2601388048534976E-2,0.29375880308674268,12,12,12,12,12,22,21,21,21,21,20,20,21,21,20,17,20,17,17,17,20,17,20,2,3.1645569620253164E-3,962,907,55,5.7172557172557176E-2]
["Roffey",null,"Horsham","Horsham Town","Horsham","Horsham","Holbrook East, Holbrook West, Roffey North, Roffey South","Horsham E","C3","Horsham and Mid Sussex","Horsham",15130,15245,15340,15245,15350,15440,15490,15465,15390,15370,975,950,945,965,935,925,950,945,960,945,0.87763713080168781,2.8481012658227847E-2,5.8016877637130801E-2,2.9535864978902954E-2,6.3291139240506328E-3,0,0.12236286919831224,1865,0.732583065380493,0.14094319399785638,0.12647374062165059,201,179,176,195,159,10,7,1,5,2,9,5.6603773584905662E-2,3.006197811963247E-2,0.10406515988853231,5,288,313,136,0.13651873938942266,2026,3549,1808,1110,1,241,329,127,75,60,65,323,88,0.27244582043343651,31,10,206,3.2258064516129031E-2,90,100,110,115,265,8.4400000000000003E-2,270,7.3200000000000001E-2,250,8.1699999999999995E-2,225,8.8000000000000009E-2,250,8.6200000000000013E-2,240,8.067226890756303E-2,176,3,173,0.98462301587301593,78,107,0.45537665493547846,0.62435442553089615,0.37858899286391479,0.52527978009448417,0.54428186792058009,0.68756403259151666,156,13,8.3333333333333329E-2,4.9345650854239163E-2,0.13734845867693996,"No Sig diff",181,10,5.5248618784530384E-2,3.0283475638943135E-2,9.8699810755813064E-2,"No Sig diff",108,12,0.1111111111111111,6.4712669289837363E-2,0.18422416606859585,"No Sig diff",153,15,9.8039215686274508E-2,6.0315942800075413E-2,0.15545263698202605,"No Sig diff",171,23,0.13450292397660818,9.1326032311684457E-2,0.19374055977050725,"No Sig diff",177,23,0.12994350282485875,8.8171749186438317E-2,0.18743683717269055,"Sig better than Eng.",183,21,0.11475409836065574,7.6292257179258957E-2,0.16905724453217186,"Sig better than Eng.",157,16,0.10191082802547771,6.3707629183896414E-2,0.15912956144771889,"Sig better than Eng.",180,111,0.6166666666666667,0.54390527473114403,0.68455244242047963,180,34,36,26.111111111111114,0.23202614379084957,216,130,0.60185185185185186,0.53533927843598739,0.66480495384863836,216,34,43,24.302325581395348,0.28522571819425446,2458,2411,47,44,3,0.93617021276595747,6.3829787234042548E-2,0.96952380952380945,3.047619047619048E-2,1.3974386294255415E-2,8.8247958700979443E-2,0.96285714285714286,3.7142857142857144E-2,1.9216974525702958E-2,0.10027032537346971,0.94946428571428565,5.0535714285714281E-2,3.0601532803567904E-2,0.12341567690348033,0.8962286324786326,0.10377136752136751,6.3513981388531537E-2,0.18105039578114984,45,44,43,43,44,36,33,32,35,32,33,36,34,34,30,29,29,30,32,30,33,31,31,19,2.0169851380042462E-2,1483,1384,99,6.6756574511126099E-2]
["Rural Chichester",null,"Chichester","Chichester Central","Chichester","Arch","Boxgrove, Chichester North, Chichester West, Donnington, Funtington, Lavant, North Mundham, Sidlesham, Tangmere, Westbourne","Chichester","A","Coastal West Sussex","Chichester",21745,21680,21900,21990,22135,22310,22585,22720,22920,23175,1110,1095,1100,1115,1085,1110,1135,1105,1145,1145,0.92321589882565491,3.6133694670280034E-2,2.1680216802168022E-2,9.9367660343270096E-3,1.8066847335140017E-3,7.2267389340560069E-3,7.6784101174345074E-2,2290,0.56968108344255131,0.23503713411970292,0.19528178243774574,210,200,234,217,181,12,13,17,11,12,5,2.7624309392265192E-2,1.1855936781179247E-2,6.302693261946242E-2,26,312,362,186,0.16446757547648186,2468,4506,2479,1534,0,288,484,173,115,100,100,484,157,0.32438016528925617,39,6,268,2.7515400410677619E-2,165,180,180,155,455,0.11899999999999999,480,0.12423076923076923,520,0.12946153846153849,500,0.11853846153846151,490,0.11215384615384615,430,0.11154345006485085,204,20,184,0.90197211785948439,80,106,0.45657078592598954,0.59504290957910866,0.3652107328102534,0.50702204203834245,0.50384253148518054,0.64521923119145763,160,19,0.11874999999999999,7.7354868005923477E-2,0.17802285581234925,"No Sig diff",205,13,6.3414634146341464E-2,3.7430869080185898E-2,0.1054596230146583,"No Sig diff",206,15,7.281553398058252E-2,4.4620647992736441E-2,0.11665090916704798,"No Sig diff",187,11,5.8823529411764705E-2,3.3160194848180356E-2,0.1022477976309254,"No Sig diff",179,28,0.15642458100558659,0.11049727235884879,0.21678877757022358,"No Sig diff",160,20,0.125,8.2394535844441938E-2,0.18519011053418696,"Sig better than Eng.",175,28,0.16,0.11307943399181344,0.22152675416666595,"No Sig diff",180,22,0.12222222222222222,8.2115405015210363E-2,0.17811674897000837,"Sig better than Eng.",230,120,0.52173913043478259,0.45735647256549594,0.5854075439199975,230,34,46,19.760869565217394,0.41879795396419428,234,126,0.53846153846153844,0.4744816006810863,0.60119906529384781,234,34,46,22.347826086956527,0.34271099744245509,3372,3112,260,221,39,0.85,0.15,null,0.17647058823529413,9.5722957258098984E-2,0.30254405172778037,null,0.17647058823529413,9.5722957258098984E-2,0.30254405172778037,null,0.18,9.7700827324537901E-2,0.30796319454702614,null,0.28000000000000003,0.17474014357680359,0.41665387145989663,54,50,50,54,50,45,44,45,43,45,45,43,45,69,67,65,66,66,67,63,66,64,67,21,1.8987341772151899E-2,1723,1581,142,8.2414393499709804E-2]
["Rural Henfield, Steyning and Upper Beeding",null,"Horsham","Horsham Rural","Horsham","based on 2 sites","Bramber, Upper Beeding and Woodmancote, Cowfold, Shermanbury and West Grinstead, Henfield, Nuthurst, Buckingham, Manor, Steyning","Billingshurst, Steyning/Storrington","C3/B","Horsham and Mid Sussex","Arundel and South Downs",27235,27490,27485,27665,27665,27750,27890,27850,27865,27915,1275,1285,1260,1305,1265,1265,1275,1280,1325,1305,0.93570875290472499,2.2463206816421378E-2,2.7110766847405113E-2,1.0069713400464756E-2,1.5491866769945779E-3,3.0983733539891559E-3,6.4291247095274978E-2,2715,0.70202578268876614,0.11344383057090239,0.18453038674033148,246,238,240,238,228,12,10,8,16,9,14,6.1403508771929821E-2,3.6925597628576258E-2,0.10041592438677761,23,355,458,190,0.13331078684521894,3084,5413,3469,2348,1,415,523,182,110,105,85,497,134,0.26961770623742454,57,8,280,2.3984923762206612E-2,160,160,135,120,405,8.0611111111111119E-2,425,7.5333333333333322E-2,415,8.6388888888888904E-2,380,8.6000000000000021E-2,395,8.3666666666666653E-2,330,7.3660714285714288E-2,242,2,240,0.99047619047619051,111,149,0.46062186270519612,0.62584221334221335,0.40050631657407987,0.52567527016091531,0.5580016762847223,0.67985765534695974,231,14,6.0999999999999999E-2,3.5999999999999997E-2,9.9000000000000005E-2,"No Sig diff",230,15,6.5000000000000002E-2,0.04,0.105,"No Sig diff",176,13,7.3863636363636367E-2,4.3671472994869648E-2,0.12226055967645509,"No Sig diff",236,18,7.6271186440677971E-2,4.8786992568433107E-2,0.11732882000457022,"No Sig diff",265,31,0.11700000000000001,8.4000000000000005E-2,0.161,"Sig better than Eng.",230,31,0.13500000000000001,9.7000000000000003E-2,0.185,"Sig better than Eng.",219,30,0.13698630136986301,9.7668720477282839E-2,0.18881952618270312,"Sig better than Eng.",201,23,0.11442786069651742,7.7469981483862999E-2,0.16584726058050997,"Sig better than Eng.",270,155,0.57407407407407407,0.51445921214610213,0.63161070791735763,270,34,54,24.518518518518523,0.27886710239651402,260,153,0.58846153846153848,0.52777950947191454,0.64656761628159143,260,34,52,27.500000000000011,0.19117647058823498,3945,3878,67,60,7,0.89552238805970152,0.1044776119402985,0.89917119917119925,0.10082880082880083,7.1581992836351707E-2,0.17759209866429901,0.9474488474488475,5.2551152551152558E-2,2.9236134754816855E-2,0.10870448882000433,0.90750453250453256,9.2495467495467498E-2,7.1581992836351707E-2,0.17759209866429901,0.80558793058793066,0.19441206941206943,0.15442678106920676,0.28940587930164563,81,79,80,80,80,51,48,49,48,49,51,47,49,71,69,65,67,66,69,67,68,70,69,19,1.4740108611326609E-2,2032,1891,141,6.9389763779527561E-2]
["Rural Horsham",null,"Horsham","Horsham Rural","Horsham","Chanctonbury","Billingshurst and Shipley, Broadbridge Heath, Itchingfield, Slinfold and Warnham, Rudgwick, Rusper and Colgate","Billingshurst","C3","Coastal West Sussex","Horsham",14005,14120,14350,14600,14705,14730,14765,14770,14845,15110,785,780,795,825,825,785,765,780,730,790,0.91592356687898091,4.2038216560509552E-2,2.6751592356687899E-2,1.4012738853503185E-2,1.2738853503184713E-3,0,8.4076433121019103E-2,1660,0.67108433734939754,0.16385542168674699,0.16506024096385541,122,155,123,135,134,4,5,1,3,4,9,6.7164179104477612E-2,3.573460604589504E-2,0.12271887382554017,6,221,276,114,0.14875269216837225,1769,3153,1642,1054,0,190,298,100,75,55,45,303,102,0.33663366336633666,32,6,170,2.8504359490274984E-2,95,80,80,85,245,8.4000000000000019E-2,260,8.8625000000000009E-2,270,9.3500000000000014E-2,270,9.2000000000000012E-2,250,8.5499999999999993E-2,240,9.03954802259887E-2,142,8,134,0.94747924685521445,52,71,0.40079365079365081,0.53690476190476188,0.30976736607385452,0.47259151542490918,0.44569249320882598,0.61234513839150362,145,10,6.8965517241379309E-2,3.7888953275645364E-2,0.12229127479787401,"No Sig diff",131,13,9.9236641221374045E-2,5.8914886907542818E-2,0.16239285539726198,"No Sig diff",82,6,7.3170731707317069E-2,3.3964777256659195E-2,0.15057843808854837,"No Sig diff",122,13,0.10655737704918032,6.3336996121428416E-2,0.1737983573650079,"No Sig diff",123,23,0.18699186991869918,0.12795837432731735,0.26498458993763258,"No Sig diff",128,18,0.140625,9.083969494262252E-2,0.21135249237896167,"No Sig diff",125,19,0.152,9.9520834204329611E-2,0.22523067981666553,"No Sig diff",103,18,0.17475728155339806,0.11349896556855764,0.25940364415299016,"No Sig diff",152,85,0.55921052631578949,0.47978845905599204,0.63571353981011325,152,34,30,24.766666666666669,0.27156862745098032,150,89,0.59333333333333338,0.51334665051332073,0.668658903871305,150,34,30,26.6,0.21764705882352936,2449,2382,67,52,15,0.77611940298507465,0.22388059701492538,0.900595238095238,9.9404761904761912E-2,3.9457573336373918E-2,0.19577736249133981,0.91845238095238091,8.1547619047619049E-2,2.864359650368855E-2,0.17260178091636799,0.88511904761904758,0.11488095238095238,5.0966556283051322E-2,0.21825793795231954,0.76557539682539688,0.23442460317460317,0.13195287989578958,0.34938926831587819,40,39,39,39,39,33,32,33,32,33,33,32,33,45,39,42,37,42,43,38,39,38,43,13,1.6602809706257982E-2,1220,1127,93,7.6229508196721307E-2]
["Selsey",null,"Chichester","Chichester Rural","Chichester","Arch","East Wittering, Selsey North, Selsey South, Sidlesham, West Wittering","Manhood","A","Coastal West Sussex","Chichester",20565,20845,21190,21470,21585,21515,21515,21455,21385,21365,740,740,770,825,875,890,885,890,910,885,0.94813979706877116,3.269447576099211E-2,1.2401352874859075E-2,5.6369785794813977E-3,1.1273957158962795E-3,0,5.1860202931228859E-2,1790,0.61353467561521258,0.13646532438478748,0.25,201,175,189,190,177,15,11,14,11,12,19,0.10734463276836158,6.9804882037872676E-2,0.16156606074013427,20,259,270,166,0.15413943008047112,1966,3509,1980,1107,3,259,429,182,145,105,100,427,142,0.33255269320843089,39,4,306,3.1436202999794535E-2,170,150,165,170,490,0.14400000000000004,525,0.14028571428571429,555,0.1622142857142857,490,0.15200000000000005,520,0.14157142857142854,450,0.14285714285714285,173,21,152,0.87554299579069161,48,66,0.35143869513617415,0.47400011286565907,0.24720854569312695,0.39345222781022515,0.35799524971462582,0.5136693122508571,191,20,0.10471204188481675,6.8812850350840088E-2,0.15619808462188514,"No Sig diff",162,19,0.11728395061728394,7.6382886848500614E-2,0.1759150555250806,"No Sig diff",179,16,8.9385474860335198E-2,5.5768700800059426E-2,0.14025609057858801,"No Sig diff",176,30,0.17045454545454544,0.12208717509263066,0.23290026350652712,"Sig worse than Eng.",165,31,0.18787878787878787,0.13563438589221086,0.25432587197677792,"No Sig diff",159,31,0.19496855345911951,0.14089118738057674,0.26343741110730967,"No Sig diff",156,22,0.14102564102564102,9.5011143828233793E-2,0.20429455053708973,"No Sig diff",156,30,0.19230769230769232,0.13815889455002239,0.2612459863345406,"No Sig diff",198,122,0.61616161616161613,0.54682338136658892,0.68107826118378578,198,34,39,25.512820512820511,0.24962292609351439,206,130,0.6310679611650486,0.5633394478729038,0.69399768799852601,206,34,41,23.317073170731703,0.31420373027259696,4313,3997,316,261,55,0.82594936708860756,0.17405063291139242,null,0.17543859649122806,9.8187471335966101E-2,0.29367599050593152,null,0.14035087719298245,7.2871892271282851E-2,0.25324707895892806,null,0.17543859649122806,9.8187471335966101E-2,0.29367599050593152,null,0.23636363636363636,0.1436652158745749,0.36348618721439618,61,55,56,58,56,45,41,43,41,43,44,40,43,47,42,41,37,40,41,40,42,42,42,16,1.8079096045197741E-2,1409,1255,154,0.10929737402413059]
["Sidney West",null,"Mid Sussex","Mid Sussex","Mid Sussex","Mid Sussex","Burgess Hill Franklands, Burgess Hill Leylands, Burgess Hill Meeds, Burgess Hill St Andrews","Burgess Hill","C2","Horsham and Mid Sussex","Mid Sussex",18300,18330,18385,18520,18660,18865,18970,19140,19245,19340,940,945,975,985,970,975,980,1035,1055,1050,0.83477425552353501,3.8424591738712779E-2,4.226705091258405E-2,7.0124879923150821E-2,1.1527377521613832E-2,2.881844380403458E-3,0.16522574447646493,2000,0.72177822177822182,0.12387612387612387,0.15434565434565434,190,212,187,194,193,8,9,5,3,7,9,4.6632124352331605E-2,2.4724444791412101E-2,8.6235202386319071E-2,11,335,330,155,0.14777997878599203,2200,3896,2431,1630,1,287,375,138,80,80,70,332,85,0.25602409638554219,24,8,227,2.8865717192268565E-2,120,120,130,110,320,9.7166666666666665E-2,335,9.3916666666666662E-2,365,0.10033333333333333,325,9.4999999999999987E-2,335,8.900000000000001E-2,300,9.202453987730061E-2,192,1,191,0.99444444444444458,88,111,0.46398508099859925,0.60055105210604576,0.39151197448052188,0.5315024125908222,0.51025644147427418,0.64884715857828135,158,14,8.8607594936708861E-2,5.3515080428758875E-2,0.14322967862566621,{"$f":"IF(DG35>$DH$77,\"Sig worse than Eng.\",(IF(DH35<$DG$77,\"Sig better than Eng.\",\"No Sig diff\")))","v":"No Sig diff"},169,14,8.2840236686390539E-2,4.9985852761348988E-2,0.13423764915740352,{"$f":"IF(DM35>$DN$77,\"Sig worse than Eng.\",(IF(DN35<$DM$77,\"Sig better than Eng.\",\"No Sig diff\")))","v":"No Sig diff"},180,10,5.5555555555555552E-2,3.0453273623977831E-2,9.9231613417455969E-2,"No Sig diff",134,11,8.2089552238805971E-2,4.6454325805087827E-2,0.14101799958802202,{"$f":"IF(DY35>$DZ$77,\"Sig worse than Eng.\",(IF(DZ35<$DY$77,\"Sig better than Eng.\",\"No Sig diff\")))","v":"No Sig diff"},190,26,0.1368421052631579,9.5125099973102326E-2,0.19295289510816771,{"$f":"IF(EE35>$EF$77,\"Sig worse than Eng.\",(IF(EF35<$EE$77,\"Sig better than Eng.\",\"No Sig diff\")))","v":"No Sig diff"},159,18,0.11320754716981132,7.2819302607958283E-2,0.17184479650554718,"Sig better than Eng.",164,17,0.10365853658536585,6.573150818853768E-2,0.15972803611344755,"Sig better than Eng.",150,21,0.14000000000000001,9.3426488185517978E-2,0.20455208775949715,"No Sig diff",200,104,0.52,0.4510378507281424,0.58820833621676694,200,34,40,24.45000000000001,0.28088235294117619,202,134,0.6633663366336634,0.59568952589790047,0.72494558997295899,202,35,40,27.400000000000006,0.21714285714285697,2703,2643,60,50,10,0.83333333333333337,0.16666666666666666,0.88718554729584154,0.11281445270415857,7.8935572345810806E-2,0.18974640797818437,0.92006639194139206,7.9933608058608052E-2,4.5422997117338167E-2,0.13805688382692829,0.90631995319495318,9.368004680504681E-2,5.6294191320769182E-2,0.15558638941674016,0.74459946371711061,0.25540053628288922,0.19125353600433309,0.3367839006382683,50,50,50,49,50,62,58,56,57,57,57,58,59,66,60,59,63,63,63,65,64,63,61,12,1.1527377521613832E-2,1671,1556,115,6.8821065230400963E-2]
["Southbourne",null,"Chichester","Chichester Rural","Chichester","Arch","Bosham, Fishbourne, Southbourne","Southbourne","A","Coastal West Sussex","Chichester",13500,13545,13600,13605,13840,14100,14275,14155,14250,14385,635,670,670,685,735,745,735,735,780,775,0.91393442622950816,2.185792349726776E-2,1.2295081967213115E-2,1.092896174863388E-2,3.5519125683060107E-2,5.4644808743169399E-3,8.6065573770491802E-2,1435,0.6020905923344948,9.1289198606271771E-2,0.30662020905923343,129,143,129,106,105,0,5,4,3,8,5,4.7619047619047616E-2,2.0509165674361975E-2,0.10666166583292792,10,199,254,95,0.13236886877011231,1511,2682,1519,1015,1,170,225,108,45,40,35,224,53,0.23660714285714285,25,7,137,2.3406799931658978E-2,45,45,75,50,185,8.5222222222222227E-2,205,7.7888888888888896E-2,175,7.8E-2,180,8.5777777777777786E-2,190,8.0000000000000016E-2,170,7.0981210855949897E-2,95,2,93,0.98733776511554294,49,60,0.45890652557319223,0.56956993623660279,0.42636839646712893,0.62526230769306668,0.54393306563242183,0.73487273683263454,126,18,0.14285714285714285,9.2313796541076673E-2,0.21453317808906508,"No Sig diff",108,6,5.5555555555555552E-2,2.5707729609183876E-2,0.11593436794331127,"No Sig diff",112,6,5.3571428571428568E-2,2.4780939016041947E-2,0.11197026372230079,"No Sig diff",138,8,5.7971014492753624E-2,2.9664427433011134E-2,0.11022033535539391,"No Sig diff",111,15,0.13513513513513514,8.3634396766943495E-2,0.21104540936066715,"No Sig diff",107,12,0.11214953271028037,6.5328818815477516E-2,0.18585389852616863,"Sig better than Eng.",91,13,0.14285714285714285,8.542758136548774E-2,0.22921813572656949,"No Sig diff",100,8,0.08,4.109346148438061E-2,0.14998107700948732,"Sig better than Eng.",154,81,0.52597402597402598,0.44744231332063877,0.6032414554418376,154,34,30,23.266666666666662,0.31568627450980408,153,92,0.60130718954248363,0.52215817780146556,0.67549364355426489,153,34,30,23.633333333333333,0.30490196078431375,2577,2448,129,114,15,0.88372093023255816,0.11627906976744186,0.87962962962962965,0.12037037037037036,7.3067660241051213E-2,0.38517021976637866,0.91666666666666663,8.3333333333333329E-2,4.7489172642362694E-2,0.33335411879470006,0.87962962962962965,0.12037037037037036,7.3067660241051213E-2,0.38517021976637866,0.74074074074074081,0.25925925925925924,0.13150582015814438,0.48152123699001981,34,33,33,33,33,29,25,28,25,28,28,25,29,41,32,32,31,32,32,26,36,32,33,11,1.5027322404371584E-2,1117,1045,72,6.445837063563116E-2]
["Southgate",null,"Crawley","Crawley","Crawley","Crawley","Furnace Green, Southgate, Tilgate","Crawley NW","C1","Crawley","Crawley",19675,19775,20055,20095,19945,19970,19880,20140,20365,20375,1085,1070,1135,1175,1180,1225,1275,1355,1395,1385,0.6339285714285714,7.1428571428571425E-2,7.5892857142857137E-2,0.16220238095238096,4.1666666666666664E-2,1.488095238095238E-2,0.36607142857142855,2455,0.4969450101832994,0.33319755600814666,0.16985743380855398,253,277,274,292,274,6,17,19,12,11,19,6.9343065693430656E-2,4.4838959197899111E-2,0.10575576845106792,30,447,385,216,0.15552949746409514,2399,4278,2497,1229,1,327,652,288,210,210,165,588,253,0.43027210884353739,46,4,428,5.1460863292052419E-2,300,285,265,265,735,0.16492307692307692,690,0.16269230769230766,715,0.18615384615384611,590,0.17861538461538462,575,0.18884615384615386,665,0.17007672634271101,280,10,270,0.97171594722401788,102,153,0.38011153374425688,0.55492143481273926,0.3220422730435234,0.4369424831074778,0.50703166405729405,0.62443119622397802,179,16,8.9385474860335198E-2,5.5768700800059426E-2,0.14025609057858804,"No Sig diff",208,21,0.10096153846153846,6.6986875276411589E-2,0.14940824905803252,"No Sig diff",165,17,0.10303030303030303,6.5326799711821093E-2,0.15879741175262088,"No Sig diff",218,19,8.7155963302752298E-2,5.6505621010586905E-2,0.13210411426217361,"No Sig diff",171,37,0.21637426900584794,0.16125297547340778,0.283958699982373,"No Sig diff",190,32,0.16842105263157894,0.12190040489443893,0.22808385148411195,"No Sig diff",189,33,0.17460317460317459,0.12711418630815544,0.23505616465166279,"No Sig diff",189,40,0.21164021164021163,0.15944764778291518,0.27532119981562292,"No Sig diff",254,120,0.47244094488188976,0.41191315776587761,0.53378991084057259,254,33,50,21.019999999999996,0.36303030303030315,261,134,0.51340996168582376,0.45301896964169136,0.57341193747976205,261,34,52,21.84615384615384,0.35746606334841646,2479,2437,42,38,4,0.90476190476190477,9.5238095238095233E-2,0.9010472433549358,9.8952756645064338E-2,5.4924788135547763E-2,0.14680656785678886,0.92725806956576196,7.2741930434238128E-2,3.5650162878397382E-2,0.11539746968488125,0.88393757239911097,0.11606242760088913,6.5399908149707864E-2,0.16312109648171647,0.78786982248520698,0.21213017751479291,0.16251159892911632,0.2926383742085103,80,77,77,79,78,75,73,72,73,72,73,74,73,78,71,71,69,71,73,70,74,72,72,31,2.3082650781831721E-2,2126,1832,294,0.13828786453433678]
["Southwater",null,"Horsham","Horsham Town","Horsham","Horsham","Southwater","Horsham W","C3","Horsham and Mid Sussex","Horsham",10025,10140,10345,10460,10555,10600,10635,10750,10925,10975,695,630,645,645,635,635,620,635,605,570,0.91379310344827591,1.7241379310344827E-2,4.2319749216300939E-2,2.037617554858934E-2,4.7021943573667714E-3,1.567398119122257E-3,8.6206896551724144E-2,1330,0.78270676691729324,9.2481203007518803E-2,0.12481203007518797,123,104,126,91,78,5,3,2,1,0,4,5.128205128205128E-2,2.0121012473896145E-2,0.12456676547294485,3,166,218,106,0.14678649905805458,1433,2576,1414,1047,0,134,144,89,50,25,20,183,42,0.22950819672131148,23,10,63,1.6406250000000001E-2,40,60,40,35,130,6.6285714285714281E-2,140,7.1714285714285717E-2,160,7.5428571428571428E-2,155,6.8285714285714297E-2,155,6.0285714285714283E-2,115,5.4245283018867926E-2,89,2,87,0.97922077922077932,39,54,0.46383656026513165,0.62045177045177058,0.34817004727070094,0.55275640052414199,0.51567426573095965,0.71549735608107345,118,11,9.3220338983050849E-2,5.2851600772239334E-2,0.15923925131385774,"No Sig diff",116,11,9.4827586206896547E-2,5.3777363581140956E-2,0.16185301237546282,"No Sig diff",87,9,0.10344827586206896,5.5385110337884548E-2,0.18504980896262463,"No Sig diff",110,3,2.7272727272727271E-2,9.3179698578722808E-3,7.7130841696755659E-2,"Sig better than Eng.",116,15,0.12931034482758622,7.995391352718767E-2,0.20243132405013073,"No Sig diff",123,14,0.11382113821138211,6.9022844406854716E-2,0.18201068293301853,"Sig better than Eng.",107,13,0.12149532710280374,7.2394341667617434E-2,0.19683216561760347,"No Sig diff",126,21,0.16666666666666666,0.11167188880425907,0.2413852875172065,"No Sig diff",134,89,0.66417910447761197,0.58062954335825934,0.73857775738016174,134,34,26,27.038461538461537,0.20475113122171951,135,97,0.71851851851851856,0.63742332520504075,0.78752179206137429,135,35,27,25.407407407407412,0.27407407407407397,2308,2278,30,29,1,0.96666666666666667,3.3333333333333333E-2,0.9821428571428571,1.7857142857142856E-2,3.4696032534422437E-3,0.10304807675589374,0.96785714285714286,3.2142857142857147E-2,1.0820856268751204E-2,0.1321654898626527,0.9821428571428571,1.7857142857142856E-2,3.4696032534422437E-3,0.10304807675589374,0.94387755102040816,5.6122448979591837E-2,2.0206272864052088E-2,0.15924873938941972,29,28,28,28,28,31,31,30,30,30,31,30,31,30,28,29,27,28,29,26,27,29,29,12,1.889763779527559E-2,1003,964,39,3.8883349950149554E-2]
["Stepping Stones",null,"Adur","Adur East","Adur","Adur","Eastbrook, Hillside, Southwich Green","Shoreham","B","Coastal West Sussex","East Worthing and Shoreham",13130,13040,13085,13055,13065,13160,13195,13265,13280,13390,700,680,705,710,735,775,775,805,825,830,0.88930348258706471,1.8656716417910446E-2,3.3582089552238806E-2,3.109452736318408E-2,7.462686567164179E-3,1.9900497512437811E-2,0.11069651741293532,1550,0.59199483537766295,0.20787604906391219,0.2001291155584248,109,125,107,138,115,10,7,5,7,7,5,4.3478260869565216E-2,1.8712101106831382E-2,9.7757849346889233E-2,15,256,276,106,0.12492352662605885,1665,2857,1670,843,1,307,384,135,145,130,105,384,151,0.39322916666666669,34,2,300,5.3229240596167494E-2,215,210,215,185,480,0.19444444444444442,480,0.18844444444444447,555,0.20177777777777775,515,0.17744444444444449,520,0.17844444444444446,495,0.19919517102615694,138,15,123,0.90037632661901679,51,71,0.39368252379312629,0.56805227360147259,0.33144299050634901,0.50299618402314283,0.48889394915995515,0.66089917864669501,85,4,4.7058823529411764E-2,1.8450260833070709E-2,0.11483727156318768,"No Sig diff",120,6,0.05,2.3114364414465797E-2,0.10480288536236734,"No Sig diff",92,13,0.14130434782608695,8.4476933783828992E-2,0.22688580200803002,"No Sig diff",114,11,9.6491228070175433E-2,5.4736149045213803E-2,0.16455389606543028,"No Sig diff",103,19,0.18446601941747573,0.12139537223023854,0.27022656257424815,"No Sig diff",94,19,0.20212765957446807,0.1333948198921881,0.29425067236660452,"No Sig diff",97,18,0.18556701030927836,0.12072903379332831,0.27436103418690677,"No Sig diff",90,19,0.21111111111111111,0.13952592118014923,0.30634799581257288,"No Sig diff",135,68,0.50370370370370365,0.42043501688207358,0.5867674427326115,135,34,27,21.518518518518519,0.36710239651416121,122,68,0.55737704918032782,0.46882625948307327,0.64242483480015478,122,34,24,23.166666666666668,0.31862745098039214,2004,1951,53,51,2,0.96226415094339623,3.7735849056603772E-2,0.93227513227513237,6.7724867724867729E-2,5.315354431925607E-2,0.20601533031468619,0.84338624338624335,0.15661375661375662,4.2994504137461961E-2,0.18712216950173294,0.81005291005291002,0.18994708994708998,7.459006187684232E-2,0.24268321474659466,0.78822751322751317,0.21177248677248675,0.17018055060319134,0.37951033397822453,36,33,33,33,33,24,24,24,22,24,24,22,24,30,29,30,27,30,30,27,29,27,30,26,3.2338308457711441E-2,1254,1069,185,0.14752791068580542]
["Storrington (Little Footsteps)",null,"Horsham","Horsham Rural","Horsham","Chanctonbury","Chanctonbury, Chantry","Steyning/Storrington","B","Coastal West Sussex","Arundel and South Downs",12250,12260,12325,12385,12470,12475,12705,12710,12795,12795,625,595,560,605,610,600,615,600,605,590,0.93080724876441512,3.2948929159802305E-2,2.6359143327841845E-2,9.8846787479406912E-3,0,0,6.919275123558484E-2,1245,0.68890675241157562,0.16157556270096463,0.14951768488745981,115,103,98,111,96,7,6,2,1,5,8,8.3333333333333329E-2,4.2830624150967216E-2,0.15589903239709582,7,168,196,100,0.14694188556472054,1359,2423,1459,1025,0,140,205,89,35,40,45,209,51,0.24401913875598086,15,7,132,2.4242424242424242E-2,65,50,70,90,175,0.12362499999999998,195,0.10725,215,0.11975000000000001,195,0.104375,235,9.1999999999999998E-2,160,7.9800498753117205E-2,122,4,118,0.96772660818713452,58,75,0.50400219298245619,0.63892490110079125,0.40302228798677547,0.5805629571183446,0.54575544867159853,0.71688062964648003,106,7,6.6000000000000003E-2,3.2000000000000001E-2,0.13,"No Sig diff",96,11,0.115,6.5000000000000002E-2,0.19400000000000001,"No Sig diff",91,11,0.12087912087912088,6.885508485107264E-2,0.20361498406203427,"No Sig diff",106,7,6.6037735849056603E-2,3.2354147112036276E-2,0.13007503957437352,"No Sig diff",120,21,0.17499999999999999,0.11700000000000001,0.253,"No Sig diff",112,22,0.19600000000000001,0.13300000000000001,0.28000000000000003,"No Sig diff",104,13,0.125,7.4526025237809115E-2,0.20218999054152978,"No Sig diff",94,14,0.14893617021276595,9.0840479586594094E-2,0.23459885057555427,"No Sig diff",117,64,0.54700854700854706,0.45674877894037469,0.63427958257851358,117,34,23,28.869565217391305,0.15089514066496162,134,83,0.61940298507462688,0.53495253716790758,0.69719822700548961,134,34,26,26.192307692307693,0.22963800904977372,1921,1896,25,21,4,0.84,0.16,0.923408189033189,7.6591810966810961E-2,4.2492043037232537E-2,0.16780102074279987,0.93233676046176039,6.7663239538239536E-2,3.4389161893526081E-2,0.15233056050680582,0.923408189033189,7.6591810966810961E-2,4.2492043037232537E-2,0.16780102074279987,0.85197961760461771,0.1480203823953824,0.11556188621286038,0.28331790860477624,35,35,35,35,35,18,16,18,16,18,18,16,18,30,30,30,29,30,30,29,29,29,30,14,2.3102310231023101E-2,939,864,75,7.9872204472843447E-2]
["Sussex Downs",null,"Mid Sussex","Mid Sussex","Mid Sussex","Mid Sussex","Bolney, Cuckfield, Hassocks, Hurstpierpoint and Downs","Hassocks","C2","Horsham and Mid Sussex","Mid Sussex",17565,17650,17895,18095,18490,18770,19185,19470,19695,19975,885,890,920,960,1000,1015,1065,1135,1170,1195,0.92307692307692313,2.8293545534924844E-2,3.8019451812555262E-2,8.8417329796640146E-3,8.8417329796640137E-4,8.8417329796640137E-4,7.6923076923076927E-2,2290,0.74083769633507857,0.11343804537521815,0.14572425828970331,177,186,202,176,217,5,6,7,2,3,6,2.7649769585253458E-2,1.2732431477870355E-2,5.899983702501134E-2,7,294,388,185,0.15331473238785223,2368,4334,2179,1435,2,250,324,168,55,60,50,364,82,0.22527472527472528,27,9,158,1.961271102284012E-2,85,80,95,75,275,8.4749999999999992E-2,275,7.2499999999999995E-2,275,7.3083333333333347E-2,265,7.3416666666666672E-2,305,6.9916666666666669E-2,245,6.6939890710382519E-2,205,7,198,0.96602240352240354,105,142,0.52804169514695831,0.73110749387065188,0.46087105556409669,0.59858150525587306,0.65076780881350293,0.7753088770629466,165,2,1.2E-2,3.0000000000000001E-3,4.2999999999999997E-2,"Sig better than Eng.",191,5,2.5999999999999999E-2,1.0999999999999999E-2,0.06,"Sig better than Eng.",203,8,3.9408866995073892E-2,2.0102050271229469E-2,7.5823877411838186E-2,"Sig better than Eng.",175,11,6.2857142857142861E-2,3.5457550361549364E-2,0.10903612012792414,"No Sig diff",174,14,0.08,4.9000000000000002E-2,0.13100000000000001,"Sig better than Eng.",162,21,0.13,8.5999999999999993E-2,0.19,"No Sig diff",169,20,0.11834319526627218,7.7928809241215022E-2,0.17572247974828192,"Sig better than Eng.",178,18,0.10112359550561797,6.4926616688432873E-2,0.1541733568768916,"Sig better than Eng.",230,126,0.54782608695652169,0.48324428174249945,0.61083655452558616,230,34,46,24.347826086956513,0.28388746803069081,254,168,0.66141732283464572,0.60120044816600826,0.71682443571049714,254,34,50,27.059999999999995,0.20411764705882368,3264,3239,25,24,1,0.96,0.04,0.91988817509650833,8.0111824903491571E-2,5.2836307068052514E-2,0.14150749816822447,0.93379961088294428,6.620038911705578E-2,4.3420566103405354E-2,0.12650941504912244,0.90401766443433107,9.5982335565668889E-2,6.740122032002023E-2,0.16356332104188054,0.8422166953416953,0.15778330465830465,0.11864352018350914,0.23439014159713753,56,52,52,53,52,70,63,63,60,64,67,67,68,74,70,72,67,72,71,56,71,67,72,14,1.237842617152962E-2,1748,1643,105,6.0068649885583525E-2]
["The Gattons",null,"Mid Sussex","Mid Sussex","Mid Sussex","Mid Sussex","Burgess Hill Dunstall, Burgess Hill Victoria","Burgess Hill","C2","Horsham and Mid Sussex","Mid Sussex",10660,10735,10835,10865,10945,10870,11015,11065,11080,11015,895,880,890,855,850,815,825,810,780,765,0.89027431421446379,2.2443890274314215E-2,3.8653366583541147E-2,4.3640897755610975E-2,4.9875311720698253E-3,0,0.10972568578553615,1615,0.71065675340768275,0.13444857496902107,0.15489467162329615,146,149,140,139,139,5,5,3,0,6,8,5.7553956834532377E-2,2.9448901559716051E-2,0.10945656037343801,7,258,268,121,0.14698135896818981,1656,2925,1282,848,1,170,202,61,55,60,40,291,68,0.23367697594501718,18,9,96,2.2524636320976069E-2,95,90,80,70,245,0.10257142857142856,225,9.0142857142857122E-2,250,9.9000000000000005E-2,230,8.7714285714285731E-2,260,0.10242857142857142,200,8.1632653061224483E-2,128,4,124,0.96561533704390845,50,63,0.39850440176070434,0.50356309190342807,0.32104885004590489,0.49121883120964888,0.42115888884621255,0.59448547104915794,151,12,7.9470198675496692E-2,4.604266587121892E-2,0.13376356324041996,"No Sig diff",141,7,4.9645390070921988E-2,2.4253530324488039E-2,9.8925695885742862E-2,"No Sig diff",143,12,8.3916083916083919E-2,4.8653962460813528E-2,0.14094820469479138,"No Sig diff",101,5,4.9504950495049507E-2,2.1328509888006445E-2,0.11069425072968564,"No Sig diff",159,34,0.21383647798742139,0.15725209441968857,0.28392215776997809,"No Sig diff",120,18,0.15,9.7038122925847389E-2,0.22467529356724508,"No Sig diff",135,16,0.11851851851851852,7.4283486027595741E-2,0.18386317365984914,"Sig better than Eng.",128,21,0.1640625,0.10988331645919329,0.23781807603707014,"No Sig diff",163,108,0.66257668711656437,0.58698917481437962,0.73067767115200299,163,35,32,26.906250000000004,0.2312499999999999,150,107,0.71333333333333337,0.63635082260833997,0.77966187312794732,150,34,30,29.633333333333329,0.12843137254901973,2111,2085,26,25,1,0.96153846153846156,3.8461538461538464E-2,0.94065934065934076,5.9340659340659338E-2,2.5950008789329414E-2,0.11697106055647577,0.9580586080586081,4.1941391941391945E-2,1.4631662528342755E-2,9.2201872895180545E-2,0.9580586080586081,4.1941391941391945E-2,1.4631662528342755E-2,9.2201872895180545E-2,0.88284465534465539,0.11715534465534468,7.3800941708644846E-2,0.20037363859888463,35,34,34,35,34,38,38,38,38,38,38,37,38,46,45,43,44,43,43,42,43,42,43,7,8.7281795511221939E-3,1306,1227,79,6.0490045941807041E-2]
["The Needles",null,"Horsham","Horsham Town","Horsham","Horsham","Denne, Holbrook West, Trafalgar","Horsham E","C3","Horsham and Mid Sussex","Horsham",13510,13700,14090,14320,14400,14500,14600,14840,15055,15260,820,775,800,865,865,900,900,915,940,985,0.83986562150055988,4.3673012318029114E-2,4.9272116461366179E-2,5.5991041433370664E-2,6.7189249720044789E-3,4.4792833146696529E-3,0.16013437849944009,1710,0.66764189584552369,0.14921006436512579,0.18314803978935049,174,164,195,156,196,2,3,3,1,2,16,8.1632653061224483E-2,5.0870551452464711E-2,0.12847891402983311,4,291,299,111,0.13630790713323415,1691,2953,1667,1141,1,169,262,94,65,70,70,286,85,0.29720279720279719,31,9,200,3.0211480362537766E-2,95,80,105,100,235,0.1037777777777778,235,0.10033333333333334,245,9.6000000000000016E-2,250,9.2000000000000026E-2,260,8.8888888888888906E-2,230,8.9668615984405453E-2,154,3,151,0.9781201369436664,73,92,0.48621979871979876,0.60651000234333574,0.40514083756405994,0.56256809853579959,0.52966070139484978,0.68346032034607762,149,5,3.3557046979865772E-2,1.4417106348108081E-2,7.6143785490357191E-2,"Sig better than Eng.",141,9,6.3829787234042548E-2,3.3941271284132213E-2,0.11685435725018591,"No Sig diff",80,8,0.1,5.1547615567380821E-2,0.18510688806104081,"No Sig diff",133,7,5.2631578947368418E-2,2.5725728312537676E-2,0.10465477898731589,"No Sig diff",125,23,0.184,0.12585414090214395,0.26098918792151837,"No Sig diff",158,24,0.15189873417721519,0.10425003468710974,0.21607245374355769,"No Sig diff",117,10,8.5470085470085472E-2,4.7087483244617576E-2,0.15020787427064,"Sig better than Eng.",119,9,7.5630252100840331E-2,4.0297241660835648E-2,0.13750477266215499,"Sig better than Eng.",162,96,0.59259259259259256,0.51563559092203559,0.66526006818113026,162,34,32,24.46875,0.28033088235294118,185,101,0.54594594594594592,0.47399376090072665,0.61602884380781664,185,34,37,24.783783783783782,0.27106518282988873,2096,2025,71,56,15,0.78873239436619713,0.21126760563380281,0.95912975912975917,4.0870240870240868E-2,1.7224087727905863E-2,0.10763251528174392,0.96767676767676769,3.2323232323232323E-2,1.1274202463345791E-2,9.2494607847741314E-2,0.95912975912975895,4.0870240870240875E-2,1.7224087727905863E-2,0.10763251528174392,0.83677356594023267,0.16322643405976739,9.607722097921384E-2,0.24688972487264566,49,45,45,47,45,54,50,50,50,50,49,50,50,48,45,45,43,45,46,43,46,45,45,17,1.9036954087346025E-2,1395,1297,98,7.0250896057347675E-2]
["The Villages",null,"Arun West","Arun West North","Arun","Arch","Arundel, Barnham, Walberton, Yapton","Barnham/Westergate","A","Coastal West Sussex","Bognor Regis and Littlehampton",21245,21405,21340,21505,21720,21695,21740,21775,21950,22015,1045,1050,1060,1040,1035,1035,1020,1020,1030,1030,0.93579766536964981,2.5291828793774319E-2,2.4319066147859923E-2,1.4591439688715954E-2,0,0,6.4202334630350189E-2,2185,0.69258920402561752,0.12305580969807868,0.18435498627630376,185,191,178,212,164,7,6,6,4,6,10,6.097560975609756E-2,3.3454561325115796E-2,0.10859293390169864,12,269,371,159,0.14517552228463421,2354,4219,2370,1475,2,285,418,190,105,80,90,416,126,0.30288461538461536,43,4,251,2.7713370873357623E-2,110,135,155,140,420,0.11600000000000001,385,0.11278571428571428,435,0.11542857142857142,415,0.10264285714285715,440,0.11557142857142859,365,9.9455040871934602E-2,207,14,193,0.93933534952442532,85,110,0.46018530409875624,0.60210405672566514,0.37221521505149513,0.51093956523884998,0.49940629268557302,0.63775983479967402,174,27,0.15517241379310345,0.10888846203868341,0.21635324034192896,"Sig worse than Eng.",178,13,7.3033707865168537E-2,4.3175025310267297E-2,0.12093198864698146,"No Sig diff",194,14,7.2164948453608241E-2,4.3470708676375661E-2,0.11747361012564239,"No Sig diff",212,24,0.11320754716981132,7.7264917405978337E-2,0.1629181276120798,"No Sig diff",180,24,0.13333333333333333,9.1262810536594019E-2,0.1907272212725889,"No Sig diff",181,38,0.20994475138121546,0.15695179474513435,0.27499382681666318,"No Sig diff",177,29,0.16384180790960451,0.11656641651721572,0.22539863521359599,"No Sig diff",182,23,0.12637362637362637,8.5705065885255408E-2,0.18248836703857232,"Sig better than Eng.",241,129,0.53526970954356845,0.47224088134498177,0.59719180412373907,241,34,48,24.562500000000007,0.2775735294117645,209,137,0.65550239234449759,0.58879307370670031,0.71659855610146839,209,34,41,25.512195121951219,0.24964131994261121,3058,3021,37,36,1,0.97297297297297303,2.7027027027027029E-2,0.91651404151404159,8.3485958485958481E-2,6.9158620605686214E-2,0.16758575632747763,0.93107448107448121,6.8925518925518917E-2,5.4210515626730349E-2,0.14499669951626121,0.89275684632827512,0.1072431536717251,8.4547343075125556E-2,0.18973419564821054,0.73381301238444085,0.26618698761555903,0.20578932597912503,0.34376473253880774,61,58,58,60,59,53,52,53,52,53,53,51,53,67,64,65,61,64,64,57,61,61,65,19,1.8482490272373541E-2,1627,1483,144,8.8506453595574672E-2]
["The Wave",null,"Worthing","Worthing","Worthing","CCC","Broadwater, Gaisford","Worthing","B","Coastal West Sussex","East Worthing and Shoreham",13165,13320,13405,13530,13660,13830,13930,14030,14190,14215,875,890,900,915,950,995,995,1000,1010,965,0.83480825958702065,2.8515240904621434E-2,6.5880039331366769E-2,5.1130776794493606E-2,1.4749262536873156E-2,4.9164208456243851E-3,0.16519174041297935,1995,0.66984445559458106,0.10386352232814852,0.22629202207727045,183,162,185,166,151,14,5,10,8,8,9,5.9602649006622516E-2,3.167075659834806E-2,0.10938616050281703,17,292,331,171,0.16135239546166366,1975,3591,1617,880,0,264,366,107,125,120,90,476,162,0.34033613445378152,35,4,315,5.4254219772648986E-2,175,155,160,135,440,0.15611111111111112,455,0.13388888888888886,485,0.15444444444444447,405,0.14644444444444446,470,0.13633333333333331,410,0.13333333333333333,172,4,168,0.97713264643089193,70,87,0.41528562596674057,0.51025165065412736,0.34479298206061598,0.49226626319780803,0.44274583327172728,0.59217004274432472,130,14,0.1076923076923077,6.5241339616437855E-2,0.17266296224380834,"No Sig diff",186,13,6.9892473118279563E-2,4.1297216253746931E-2,0.11589425818008303,"No Sig diff",159,13,8.1761006289308172E-2,4.8402298802567148E-2,0.13485237747463791,"No Sig diff",192,25,0.13020833333333334,8.9774224743510128E-2,0.18514947703502674,"No Sig diff",152,20,0.13157894736842105,8.6817115241413917E-2,0.19450378070282012,"No Sig diff",163,32,0.19631901840490798,0.14263444430709368,0.26398786228400306,"No Sig diff",148,17,0.11486486486486487,7.2964239324355348E-2,0.17625266832785691,"Sig better than Eng.",146,22,0.15068493150684931,0.10166464144505639,0.21761587809355135,"No Sig diff",222,118,0.53153153153153154,0.46591247372915356,0.59607791578172553,222,34,44,24.886363636363633,0.26804812834224606,203,141,0.69458128078817738,0.62809552282698589,0.75383951307161123,203,34,40,26.025000000000006,0.2345588235294116,2577,2501,76,65,11,0.85526315789473684,0.14473684210526316,0.88145604395604382,0.11854395604395604,7.1709958980432961E-2,0.19511025818384223,0.92870879120879124,7.1291208791208788E-2,3.8009793445671562E-2,0.13939825508010059,0.88305860805860803,0.11694139194139194,7.1709958980432961E-2,0.19511025818384223,0.81379731379731379,0.18620268620268621,0.12319860172367546,0.26879865153450394,38,36,36,37,36,54,50,51,50,52,53,49,52,52,48,47,45,48,51,47,50,46,50,20,1.966568338249754E-2,1566,1396,170,0.10855683269476372]
["Treehouse",null,"Arun West","Arun West North","Arun","Arch","Bersted, Orchard","Bognor Regis/Felpham","A","Coastal West Sussex","Bognor Regis and Littlehampton",13355,13435,13285,13270,13255,13215,13290,13380,13845,14270,790,780,770,780,805,855,870,900,960,1055,0.8165137614678899,0.11582568807339449,2.8669724770642203E-2,2.8669724770642203E-2,5.7339449541284407E-3,4.5871559633027525E-3,0.1834862385321101,1590,0.55499685732243875,0.17284726587052168,0.27215587680703962,181,205,186,208,219,16,9,15,12,15,10,4.5662100456621002E-2,2.4989013068053595E-2,8.1999421430922537E-2,25,278,265,130,0.14120386595365619,1626,2858,1629,778,1,284,410,156,140,135,130,409,162,0.39608801955990219,34,1,382,6.7694488747120321E-2,185,170,190,220,535,0.22511111111111115,540,0.21177777777777779,585,0.21944444444444444,575,0.20233333333333334,620,0.19422222222222224,515,0.18864468864468864,200,7,193,0.96329494760867318,79,93,0.41464355972233413,0.4833177411501387,0.34238121808503996,0.47981083887852871,0.41241407003029495,0.55202434136241874,132,14,0.106,6.4000000000000001E-2,0.17,"No Sig diff",141,14,9.9000000000000005E-2,0.06,0.16,"No Sig diff",157,23,0.1464968152866242,9.9644421057218227E-2,0.21023500422365618,"Sig worse than Eng.",177,17,9.6045197740112997E-2,6.0832403068680117E-2,0.14841971791876588,"No Sig diff",155,33,0.2129032258064516,0.15580823566402421,0.28388464640358285,"No Sig diff",124,25,0.20161290322580644,0.14045648042948655,0.28070156420930498,"No Sig diff",114,22,0.19298245614035087,0.13103892161535791,0.27494263444708866,"No Sig diff",112,20,0.17857142857142858,0.11867660544910416,0.25978426052250259,"No Sig diff",174,66,0.37931034482758619,0.31055707756930351,0.45327751826391088,174,31,34,19.382352941176478,0.37476280834914588,199,88,0.44221105527638194,0.37494971073800898,0.5116612408213006,199,33,39,20.333333333333332,0.38383838383838387,1967,1849,118,101,17,0.85593220338983056,0.1440677966101695,0.80888710055376711,0.1911128994462328,0.12559204496833837,0.27354270907748762,0.8403833820500487,0.1596166179499513,0.11019873582848602,0.25251994270496581,0.85686689853356524,0.14313310146643482,9.5097773135579794E-2,0.23120482988549781,0.65537163453830127,0.34462836546169878,0.26503550667530684,0.44363588922569969,55,53,54,53,54,50,46,44,46,44,45,45,45,49,42,44,39,44,45,41,45,41,47,17,1.9495412844036698E-2,1401,1225,176,0.12562455389007851]
["Worthing Central",null,"Worthing","Worthing","Worthing","CCC","Marine, Tarring","Worthing","B","Coastal West Sussex","Worthing West",15975,16075,16115,16215,16445,16465,16535,16690,16745,16800,835,820,835,920,960,955,995,1040,995,950,0.87996127783155853,1.9361084220716359E-2,6.8731848983543078E-2,2.3233301064859633E-2,5.8083252662149082E-3,2.9041626331074541E-3,0.12003872216844143,1920,0.72173006774361648,6.3574778530484627E-2,0.2146951537258989,177,194,199,192,180,5,7,4,7,6,19,0.10555555555555556,6.8622994329574208E-2,0.15897234291969828,10,305,362,126,0.11040218512385018,1957,3375,1779,871,2,301,459,146,95,95,65,410,120,0.29268292682926828,46,6,284,3.7576078327599897E-2,125,135,150,115,330,9.7599999999999992E-2,290,8.660000000000001E-2,295,9.8500000000000004E-2,260,9.8999999999999991E-2,295,0.10369999999999999,300,0.10256410256410256,182,3,179,0.97499999999999998,81,101,0.46937373737373739,0.5735577200577201,0.38135730949003172,0.52566603749446195,0.49100901444444317,0.6347829278706536,147,10,6.8027210884353748E-2,3.7367568349765325E-2,0.12068883740957281,"No Sig diff",180,12,6.6666666666666666E-2,3.8544074935702596E-2,0.11289868992969539,"No Sig diff",162,10,6.1728395061728392E-2,3.3871842697269186E-2,0.10988870421441249,"No Sig diff",178,12,6.741573033707865E-2,3.898189964215943E-2,0.11412652239347416,"No Sig diff",152,23,0.15131578947368421,0.10299520465345144,0.21682635757948435,"No Sig diff",148,18,0.12162162162162163,7.833277129047371E-2,0.18405576956082262,"Sig better than Eng.",151,26,0.17218543046357615,0.1202985593941184,0.24033779243306463,"No Sig diff",132,17,0.12878787878787878,8.1986655242001494E-2,0.19658410768423812,"No Sig diff",200,109,0.54500000000000004,0.475786113724881,0.61251780690116497,200,34,40,26.749999999999996,0.21323529411764716,212,123,0.58018867924528306,0.51290566369236901,0.64461736355998478,212,34,42,26.61904761904762,0.21708683473389351,2349,2302,47,38,9,0.80851063829787229,0.19148936170212766,0.90526844070961732,9.4731559290382822E-2,6.0704434258640506E-2,0.17357043245469891,0.91740079365079374,8.2599206349206339E-2,4.7917980164869027E-2,0.15269863893147434,0.925436507936508,7.4563492063492068E-2,4.7917980164869027E-2,0.15269863893147434,0.83954481792717084,0.16045518207282913,0.11549589521930297,0.25341196196202076,39,39,39,39,39,45,43,45,43,45,45,43,45,59,56,54,54,57,58,57,57,57,58,13,1.2584704743465635E-2,1567,1408,159,0.10146777281429484]
["CFC Group - Adur East",null,"n/a","CFC Group - Adur East","Adur",null,"n/a","n/a","n/a","Coastal West Sussex","East Worthing and Shoreham",27300,27205,27465,27495,27515,27770,27820,27855,28125,28580,1470,1455,1510,1510,1565,1590,1630,1710,1770,1825,0.89380530973451322,2.0648967551622419E-2,4.1297935103244837E-2,2.9498525073746312E-2,2.9498525073746312E-3,1.1799410029498525E-2,0.10619469026548672,3208,0.5960099750623441,0.20511221945137156,0.19887780548628428,{"$f":"AQ20+AQ39","v":259},{"$f":"AR20+AR39","v":293},{"$f":"AS20+AS39","v":276},{"$f":"AT20+AT39","v":316},317,{"$f":"AV20+AV39","v":17},{"$f":"AW20+AW39","v":12},{"$f":"AX20+AX39","v":12},{"$f":"AY20+AY39","v":11},13,21,6.6246056782334389E-2,4.373390669612897E-2,9.9144943777846523E-2,24,{"$f":"BF20+BF39","v":555},{"$f":"BG20+BG39","v":572},{"$f":"BH20+BH39","v":212},{"$f":"BH48/BJ48","v":6.2982768865121802E-2},{"$f":"BJ20+BJ39","v":3366},5787,3378,1740,4,585,790,259,280,235,200,789,307,0.38910012674271227,64,"n/a",645,5.3580328958298722E-2,{"$f":"CB20+CB39","v":380},{"$f":"CC20+CC39","v":375},370,{"$f":"CE20+CE39","v":340},895,0.18011697985441,905,0.17256772141302529,975,0.18370287490287487,935,0.16952676497596283,965,0.16842979012927198,930,0.18058252427184465,{"$f":"CR20+CR39","v":319},{"$f":"CS20+CS39","v":20},{"$f":"CT20+CT39","v":299},{"$f":"CT48/CR48","v":0.93730407523510972},{"$f":"CV20+CV39","v":124},{"$f":"CW20+CW39","v":166},0.41471571906354515,0.55518394648829428,0.36029897736062799,0.47129607505194154,0.49851037608616161,0.61045753117629342,{"$f":"DD20+DD39","v":213},{"$f":"DE20+DE39","v":10},4.6948356807511735E-2,2.5698400422747351E-2,8.425040249694056E-2,"Sig better than Eng.",{"$f":"DJ20+DJ39","v":276},{"$f":"DK20+DK39","v":15},5.434782608695652E-2,3.3208743744781791E-2,8.7722082456984568E-2,"Sig better than Eng.",{"$f":"DP20+DP39","v":224},{"$f":"DQ20+DQ39","v":22},9.8214285714285712E-2,6.5756221573603557E-2,0.14422074692160006,"No Sig diff",{"$f":"DV20+DV39","v":279},{"$f":"DW20+DW39","v":28},0.1003584229390681,7.0350311392395601E-2,0.14122213300879916,"No Sig diff",{"$f":"EB20+EB39","v":238},{"$f":"EC20+EC39","v":44},0.18487394957983194,0.14069884589089099,0.23906010556658902,"No Sig diff",{"$f":"EH20+EH39","v":214},{"$f":"EI20+EI39","v":46},0.21495327102803738,0.16519838423066768,0.2747612971795706,"No Sig diff",{"$f":"EN20+EN39","v":218},{"$f":"EO20+EO39","v":36},0.16513761467889909,0.12173288009530026,0.22013946073704996,"No Sig diff",{"$f":"ET20+ET39","v":215},{"$f":"EU20+EU39","v":46},0.21395348837209302,0.16440969363966532,0.27353958405739576,"No Sig diff",314,156,0.49681528662420382,0.44188651347485403,0.55182104120532927,314,34,62,22.870967741935495,0.32732447817836779,294,174,0.59183673469387754,0.53482179706187938,0.64648271378027622,294,34,58,25.379310344827587,0.25354969574036507,{"$f":"FT20+FT39","v":4052},{"$f":"FU20+FU39","v":3973},{"$f":"FV20+FV39","v":79},{"$f":"FW20+FW39","v":73},{"$f":"FX20+FX39","v":6},{"$f":"FW48/FV48","v":0.92405063291139244},{"$f":"FX48/FV48","v":7.5949367088607597E-2},null,null,null,null,null,null,null,null,null,null,null,null,null,null,null,null,{"$f":"GQ20+GQ39","v":93},85,86,88,86,66,64,65,62,65,65,62,65,71,67,67,64,67,68,63,66,63,68,48,2.8301886792452831E-2,2641,2287,354,0.13404013631200304]
["CFC Group - Adur West",null,"n/a","CFC Group - Adur West","Adur",null,"n/a","n/a","n/a","Coastal West Sussex","East Worthing and Shoreham",29760,29685,29960,30165,30300,30380,30535,30635,30915,31085,1465,1435,1470,1535,1520,1640,1725,1755,1805,1840,0.89565217391304353,3.4782608695652174E-2,4.3478260869565216E-2,1.7391304347826087E-2,2.8985507246376812E-3,5.7971014492753624E-3,0.10434782608695652,3211,0.62099034568670197,0.16256617876051074,0.21644347555278728,{"$f":"AQ7+AQ21","v":354},346,345,377,371,22,26,15,{"$f":"AY7+AY21","v":21},11,22,5.9299191374663072E-2,3.9483053394127665E-2,8.8148129589767241E-2,27,{"$f":"BF7+BF21","v":589},{"$f":"BG7+BG21","v":517},{"$f":"BH7+BH21","v":247},{"$f":"BH49/BJ49","v":7.439759036144579E-2},{"$f":"BJ7+BJ21","v":3320},5743,3348,1712,2,565,802,267,265,275,260,802,325,0.40523690773067333,92,"n/a",644,4.6592388945159893E-2,{"$f":"CB7+CB21","v":380},{"$f":"CC7+CC21","v":340},355,{"$f":"CE7+CE21","v":335},870,0.17352507836990594,855,0.17224313308523834,985,0.18749792339640056,880,0.16750447658402201,925,0.16530515970515972,785,0.15287244401168451,{"$f":"CR7+CR21","v":379},{"$f":"CS7+CS21","v":26},{"$f":"CT7+CT21","v":353},{"$f":"CT49/CR49","v":0.93139841688654357},{"$f":"CV7+CV21","v":131},{"$f":"CW7+CW21","v":163},0.37110481586402266,0.46175637393767704,0.32234894432887634,0.42263584443210189,0.41044073960374611,0.51389540651214849,{"$f":"DD7+DD21","v":264},{"$f":"DE7+DE21","v":17},6.4393939393939392E-2,4.0589617518918868E-2,0.10069343472889242,"No Sig diff",{"$f":"DJ7+DJ21","v":287},{"$f":"DK7+DK21","v":27},9.4076655052264813E-2,6.5461356844761939E-2,0.13341489365690332,"No Sig diff",{"$f":"DP7+DP21","v":272},{"$f":"DQ7+DQ21","v":29},0.10661764705882353,7.5265326856754355E-2,0.14892671115335882,"No Sig diff",{"$f":"DV7+DV21","v":315},{"$f":"DW7+DW21","v":22},6.9841269841269843E-2,4.6571287675486066E-2,0.10347651036698424,"No Sig diff",{"$f":"EB7+EB21","v":244},{"$f":"EC7+EC21","v":45},0.18442622950819673,0.14078630607299766,0.23784872644827881,"No Sig diff",{"$f":"EH7+EH21","v":254},{"$f":"EI7+EI21","v":33},0.12992125984251968,9.4027695335937009E-2,0.17684208309353841,"Sig better than Eng.",{"$f":"EN7+EN21","v":222},{"$f":"EO7+EO21","v":39},0.17567567567567569,0.13125584687818342,0.23112871815277405,"No Sig diff",{"$f":"ET7+ET21","v":246},{"$f":"EU7+EU21","v":32},0.13008130081300814,9.3670872414040679E-2,0.1778671627099957,"Sig better than Eng.",347,171,0.49279538904899134,0.4405602602109211,0.54518828838762023,347,34,69,21.420289855072468,0.36999147485080974,335,184,0.54925373134328359,0.49571356302278635,0.60167711672122548,335,34,66,21.621212121212125,0.36408199643493749,{"$f":"FT7+FT21","v":4003},{"$f":"FU7+FU21","v":3955},{"$f":"FV7+FV21","v":48},{"$f":"FW7+FW21","v":39},{"$f":"FX7+FX21","v":9},0.8125,0.1875,null,null,null,null,null,null,null,null,null,null,null,null,null,null,null,null,{"$f":"GQ7+GQ21","v":96},94,94,95,94,106,101,104,100,103,105,102,104,88,84,82,80,82,83,82,84,83,83,31,1.7971014492753623E-2,2686,2343,343,0.12769918093819807]
["CFC Group - Arun East",null,"n/a","CFC Group - Arun East","Arun",null,"n/a","n/a","n/a","Coastal West Sussex","Worthing W/Bognor and Littlehampton",53555,53925,54555,54965,55265,55595,55840,56205,56680,57130,2675,2700,2735,2740,2760,2835,2865,2935,3070,3090,0.88581314878892736,5.1903114186851208E-2,3.8062283737024222E-2,1.9031141868512111E-2,3.4602076124567475E-3,1.7301038062283738E-3,0.11418685121107267,5674,0.57737046175537543,0.1473387381036306,0.275290800140994,{"$f":"AQ23+AQ11+AQ3","v":561},576,644,630,560,44,30,47,{"$f":"AY23+AY11+AY3","v":32},26,38,6.7857142857142852E-2,4.9834490003291265E-2,9.1768184953756049E-2,55,{"$f":"BF23+BF11+BF3","v":987},{"$f":"BG23+BG11+BG3","v":889},{"$f":"BH23+BH11+BH3","v":436},7.2054205916377456E-2,{"$f":"BJ23+BJ11+BJ3","v":6051},10574,6079,3197,3,898,1483,498,480,465,365,1482,508,0.34278002699055332,137,"n/a",1108,4.3713259951868068E-2,{"$f":"CB23+CB11+CB3","v":605},{"$f":"CC23+CC11+CC3","v":655},650,{"$f":"CE23+CE11+CE3","v":610},1745,0.22530978987583569,1735,0.20418318924111431,1805,0.22404164358264086,1690,0.20753303747534516,1810,0.20711832412523021,1655,0.17239583333333333,{"$f":"CR23+CR11+CR3","v":588},{"$f":"CS23+CS11+CS3","v":23},{"$f":"CT23+CT11+CT3","v":565},0.96088435374149661,{"$f":"CV23+CV11+CV3","v":207},{"$f":"CW23+CW11+CW3","v":263},0.36637168141592918,0.46548672566371679,0.32766968695072873,0.40687849399049719,0.42472843243816932,0.50671116396386917,{"$f":"DD23+DD11+DD3","v":416},{"$f":"DE23+DE11+DE3","v":22},5.2884615384615384E-2,3.5180459502092254E-2,7.877078998879293E-2,"Sig better than Eng.",{"$f":"DJ23+DJ11+DJ3","v":472},{"$f":"DK23+DK11+DK3","v":40},8.4745762711864403E-2,6.2851118482604509E-2,0.1133450856659019,"No Sig diff",{"$f":"DP23+DP11+DP3","v":364},{"$f":"DQ23+DQ11+DQ3","v":27},7.4175824175824176E-2,5.1475936681714074E-2,0.10576968485897578,"No Sig diff",{"$f":"DV23+DV11+DV3","v":513},{"$f":"DW23+DW11+DW3","v":47},9.1617933723196876E-2,6.9597686036753315E-2,0.11970883562647475,"No Sig diff",{"$f":"EB23+EB11+EB3","v":486},{"$f":"EC23+EC11+EC3","v":73},0.15020576131687244,0.12119140050135882,0.18470646935522964,"Sig better than Eng.",{"$f":"EH23+EH11+EH3","v":495},{"$f":"EI23+EI11+EI3","v":84},0.16969696969696971,0.13920260146623115,0.20527850727509667,"No Sig diff",{"$f":"EN23+EN11+EN3","v":500},{"$f":"EO23+EO11+EO3","v":103},0.20599999999999999,0.17285664127336728,0.24362647091802545,"No Sig diff",{"$f":"ET23+ET11+ET3","v":506},{"$f":"EU23+EU11+EU3","v":73},0.14426877470355731,0.11633254008067927,0.17756560458431117,"Sig better than Eng.",573,306,0.53403141361256545,0.49309598153954287,0.57451358327872171,573,34,114,24.087719298245613,0.29153766769865846,623,370,0.593900481540931,0.55487551037941496,0.6317745561623187,623,34,123,24.869918699186982,0.26853180296508877,{"$f":"FT23+FT11+FT3","v":7538},{"$f":"FU23+FU11+FU3","v":7332},{"$f":"FV23+FV11+FV3","v":206},{"$f":"FW23+FW11+FW3","v":166},{"$f":"FX23+FX11+FX3","v":40},0.80582524271844658,0.1941747572815534,null,null,null,null,null,null,null,null,null,null,null,null,null,null,null,null,{"$f":"GQ23+GQ11+GQ3","v":184},176,176,182,176,163,150,155,152,155,160,148,156,143,137,132,130,133,133,131,137,130,138,53,1.8345448251990307E-2,4618,4018,600,0.12992637505413598]
["CFC Group - Arun West North",null,"n/a","CFC Group - Arun West North","Arun",null,"n/a","n/a","n/a","Coastal West Sussex","Bognor Regis and Littlehampton",34600,34840,34625,34775,34970,34910,35030,35155,35795,36285,1835,1830,1830,1815,1845,1885,1890,1920,1995,2085,0.88157894736842102,6.5789473684210523E-2,2.6315789473684209E-2,2.1052631578947368E-2,2.631578947368421E-3,2.631578947368421E-3,0.11842105263157894,3777,0.6346306592533757,0.14402965316388669,0.22133968758273762,{"$f":"AQ46+AQ44","v":366},396,364,420,383,23,15,21,{"$f":"AY46+AY44","v":16},21,20,5.2219321148825062E-2,3.405512727403584E-2,7.9276724369650539E-2,37,{"$f":"BF46+BF44","v":547},{"$f":"BG46+BG44","v":636},{"$f":"BH46+BH44","v":289},7.2613065326633169E-2,{"$f":"BJ46+BJ44","v":3980},7077,3999,2253,3,569,828,346,245,215,220,825,288,0.34909090909090912,77,"n/a",633,4.3061224489795921E-2,{"$f":"CB46+CB44","v":295},{"$f":"CC46+CC44","v":305},345,{"$f":"CE46+CE44","v":360},955,0.17712507271669578,925,0.17057567567567566,1020,0.17508473389355741,990,0.16054389129389129,1060,0.16157472297094941,880,0.13750000000000001,{"$f":"CR46+CR44","v":407},{"$f":"CS46+CS44","v":21},{"$f":"CT46+CT44","v":386},0.94840294840294836,{"$f":"CV46+CV44","v":164},{"$f":"CW46+CW44","v":203},0.42487046632124353,0.52590673575129532,0.37653529950140968,0.47468627099174598,0.47608405802744896,0.57521884869904905,{"$f":"DD46+DD44","v":306},{"$f":"DE46+DE44","v":41},0.13398692810457516,0.10032528329781232,0.17672433797437112,"Sig worse than Eng.",{"$f":"DJ46+DJ44","v":319},{"$f":"DK46+DK44","v":27},8.4639498432601878E-2,5.8819812484351107E-2,0.12034385203377765,"No Sig diff",{"$f":"DP46+DP44","v":351},{"$f":"DQ46+DQ44","v":37},0.10541310541310542,7.7449182248717607E-2,0.14192050211510529,"No Sig diff",{"$f":"DV46+DV44","v":389},{"$f":"DW46+DW44","v":41},0.10539845758354756,7.8648068865521378E-2,0.13986618642308607,"No Sig diff",{"$f":"EB46+EB44","v":335},{"$f":"EC46+EC44","v":57},0.17014925373134329,0.13370474763443638,0.21407282135263578,"No Sig diff",{"$f":"EH46+EH44","v":305},{"$f":"EI46+EI44","v":63},0.20655737704918034,0.16490994305307338,0.25550465839483955,"No Sig diff",{"$f":"EN46+EN44","v":291},{"$f":"EO46+EO44","v":51},0.17525773195876287,0.13588681157015609,0.22309071907983608,"No Sig diff",{"$f":"ET46+ET44","v":294},{"$f":"EU46+EU44","v":43},0.14625850340136054,0.11043149100924214,0.19121039315430638,"No Sig diff",415,195,0.46987951807228917,0.4223576247956472,0.51795391917043732,415,33,83,21.674698795180728,0.343190945600584,408,225,0.55147058823529416,0.50295509749998391,0.59902589324404365,408,34,80,22.987500000000008,0.3238970588235292,{"$f":"FT46+FT44","v":5025},{"$f":"FU46+FU44","v":4870},{"$f":"FV46+FV44","v":155},{"$f":"FW46+FW44","v":137},{"$f":"FX46+FX44","v":18},0.88387096774193552,0.11612903225806452,null,null,null,null,null,null,null,null,null,null,null,null,null,null,null,null,{"$f":"GQ46+GQ44","v":116},111,112,113,113,103,98,97,98,97,98,96,98,116,106,109,100,108,109,98,106,102,112,36,1.8947368421052633E-2,3028,2708,320,0.10568031704095113]
["CFC Group - Arun West South",null,"n/a","CFC Group - Arun West South","Arun",null,"n/a","n/a","n/a","Coastal West Sussex","Bognor Regis and Littlehampton",50060,50310,50585,50940,51220,51400,51500,51425,51845,52350,1985,2010,2020,2100,2150,2280,2360,2420,2530,2610,0.85232067510548526,9.2827004219409287E-2,3.1645569620253167E-2,2.1097046413502109E-2,2.1097046413502108E-3,2.1097046413502108E-3,0.14767932489451477,4444,0.59428442844284424,9.045904590459046E-2,0.31525652565256523,{"$f":"AQ6+AQ14","v":455},487,513,520,493,43,29,31,{"$f":"AY6+AY14","v":27},27,35,7.099391480730223E-2,5.1486753100632228E-2,9.7135020525032298E-2,56,{"$f":"BF6+BF14","v":840},{"$f":"BG6+BG14","v":724},{"$f":"BH6+BH14","v":320},6.6129365571399049E-2,{"$f":"BJ6+BJ14","v":4839},8245,4875,2596,2,722,1139,416,330,330,285,1132,388,0.34275618374558303,110,"n/a",1060,4.5515050023616298E-2,{"$f":"CB6+CB14","v":415},{"$f":"CC6+CC14","v":415},450,{"$f":"CE6+CE14","v":445},1105,0.15507941176470585,1135,0.14448377386196773,1150,0.15235869565217391,1085,0.14965668202764978,1140,0.14571337719298244,1040,0.14044564483457123,{"$f":"CR6+CR14","v":518},{"$f":"CS6+CS14","v":13},{"$f":"CT6+CT14","v":505},0.97490347490347495,{"$f":"CV6+CV14","v":191},{"$f":"CW6+CW14","v":230},0.37821782178217822,0.45544554455445546,0.33699179169590276,0.42128262193959698,0.41250971705250833,0.49905409281413793,{"$f":"DD6+DD14","v":418},{"$f":"DE6+DE14","v":43},0.10287081339712918,7.7272611972378502E-2,0.13570185258560061,"No Sig diff",{"$f":"DJ6+DJ14","v":407},{"$f":"DK6+DK14","v":39},9.5823095823095825E-2,7.0889963666718708E-2,0.12831451549080627,"No Sig diff",{"$f":"DP6+DP14","v":399},{"$f":"DQ6+DQ14","v":52},0.13032581453634084,0.10078687188272777,0.16691511474098436,"Sig worse than Eng.",{"$f":"DV6+DV14","v":488},{"$f":"DW6+DW14","v":46},9.4262295081967207E-2,7.1414590127644742E-2,0.12344791505948735,"No Sig diff",{"$f":"EB6+EB14","v":380},{"$f":"EC6+EC14","v":64},0.16842105263157894,0.13415388023217073,0.20932506345921909,"No Sig diff",{"$f":"EH6+EH14","v":354},{"$f":"EI6+EI14","v":68},0.19209039548022599,0.15444559487597212,0.23634606822968654,"No Sig diff",{"$f":"EN6+EN14","v":355},{"$f":"EO6+EO14","v":56},0.15774647887323945,0.12351920142870179,0.1993015205731497,"No Sig diff",{"$f":"ET6+ET14","v":353},{"$f":"EU6+EU14","v":59},0.16713881019830029,0.13184553567129084,0.20959869904112546,"No Sig diff",504,185,0.36706349206349204,0.32613570900553129,0.41000241506339791,504,32,100,21.43,0.33031250000000001,506,262,0.51778656126482214,0.47427873046250862,0.56102636230424185,506,34,100,23.280000000000005,0.31529411764705867,{"$f":"FT6+FT14","v":5649},{"$f":"FU6+FU14","v":5391},{"$f":"FV6+FV14","v":258},{"$f":"FW6+FW14","v":186},{"$f":"FX6+FX14","v":72},0.72093023255813948,0.27906976744186046,null,null,null,null,null,null,null,null,null,null,null,null,null,null,null,null,{"$f":"GQ6+GQ14","v":112},109,109,110,110,134,128,132,128,131,133,128,132,152,146,140,138,141,141,138,146,137,144,55,2.3245984784446321E-2,3782,3333,449,0.1187202538339503]
["CFC Group - Chichester Central",null,"n/a","CFC Group - Chichester Central","Chichester",null,"n/a","n/a","n/a","Coastal West Sussex","Chichester",41470,41665,42175,42615,43230,43680,44220,44815,45235,45765,2010,1985,2015,2075,2120,2235,2285,2295,2425,2420,0.87061403508771928,4.6052631578947366E-2,3.0701754385964911E-2,4.1666666666666664E-2,6.5789473684210523E-3,6.5789473684210523E-3,0.12938596491228072,4345,0.48745684695051783,0.2948216340621404,0.21772151898734177,{"$f":"AQ9+AQ31","v":499},458,510,480,430,33,26,29,{"$f":"AY9+AY31","v":23},23,24,5.5813953488372092E-2,3.779043272891823E-2,8.1703584651564756E-2,50,{"$f":"BF9+BF31","v":731},{"$f":"BG9+BG31","v":698},{"$f":"BH9+BH31","v":351},7.6387377584330798E-2,{"$f":"BJ9+BJ31","v":4595},8125,4625,2595,1,630,1053,346,310,305,280,1052,358,0.34030418250950573,70,"n/a",715,3.5893574297188757E-2,{"$f":"CB9+CB31","v":435},{"$f":"CC9+CC31","v":435},465,{"$f":"CE9+CE31","v":395},1085,0.15531265508684863,1105,0.16451966585450753,1175,0.16166481178396069,1140,0.15179082321187584,1070,0.14667864845434939,1050,0.14553014553014554,{"$f":"CR9+CR31","v":452},{"$f":"CS9+CS31","v":40},{"$f":"CT9+CT31","v":412},0.91150442477876104,{"$f":"CV9+CV31","v":190},{"$f":"CW9+CW31","v":243},0.46116504854368934,0.58980582524271841,0.41361089945461155,0.50943669639898514,0.54169372818176698,0.63625870640679072,{"$f":"DD9+DD31","v":349},{"$f":"DE9+DE31","v":35},0.10028653295128939,7.2995265798449754E-2,0.13628132847563371,"No Sig diff",{"$f":"DJ9+DJ31","v":373},{"$f":"DK9+DK31","v":29},7.7747989276139406E-2,5.4676117732342343E-2,0.10942859360760356,"No Sig diff",{"$f":"DP9+DP31","v":388},{"$f":"DQ9+DQ31","v":26},6.7010309278350513E-2,4.6136659976996015E-2,9.637367823161877E-2,"No Sig diff",{"$f":"DV9+DV31","v":383},{"$f":"DW9+DW31","v":29},7.5718015665796348E-2,5.3234401388678944E-2,0.10662814025621341,"No Sig diff",{"$f":"EB9+EB31","v":333},{"$f":"EC9+EC31","v":54},0.16216216216216217,0.12646370828997461,0.20556625979132698,"No Sig diff",{"$f":"EH9+EH31","v":324},{"$f":"EI9+EI31","v":51},0.15740740740740741,0.12179595147916422,0.20104747168465792,"No Sig diff",{"$f":"EN9+EN31","v":333},{"$f":"EO9+EO31","v":57},0.17117117117117117,0.13452302236020316,0.21531947990559702,"No Sig diff",{"$f":"ET9+ET31","v":320},{"$f":"EU9+EU31","v":39},0.121875,9.0449037019305387E-2,0.16227172059687262,"Sig better than Eng.",457,224,0.49015317286652077,0.44459387098320663,0.53587663611259317,457,34,91,20.461538461538463,0.3981900452488687,460,240,0.52173913043478259,0.47609946596788244,0.5670187150822753,460,34,91,21.736263736263741,0.36069812540400764,{"$f":"FT9+FT31","v":6478},{"$f":"FU9+FU31","v":5978},{"$f":"FV9+FV31","v":500},{"$f":"FW9+FW31","v":425},{"$f":"FX9+FX31","v":75},0.85,0.15,null,null,null,null,null,null,null,null,null,null,null,null,null,null,null,null,{"$f":"GQ9+GQ31","v":117},111,111,116,110,108,104,105,103,105,107,103,106,134,125,123,120,122,125,118,124,120,126,44,1.9332161687170474E-2,3520,3144,376,0.10681818181818181]
["CFC Group - Chichester Rural",null,"n/a","CFC Group - Chichester Rural","Chichester",null,"n/a","n/a","n/a","Coastal West Sussex","Chichester",61200,61645,61960,62350,62935,63140,63375,63320,63385,63620,2725,2765,2830,2925,3055,3055,3060,3050,3110,3085,0.93148450244698211,2.6101141924959218E-2,2.4469820554649267E-2,6.5252854812398045E-3,9.7879282218597055E-3,3.2626427406199023E-3,6.8515497553017946E-2,6199,0.61300209711243747,0.14841103403774802,0.23858686884981448,{"$f":"AQ27+AQ29+AQ34+AQ36","v":546},538,498,484,434,23,28,22,{"$f":"AY27+AY29+AY34+AY36","v":21},27,40,9.2165898617511524E-2,6.8414524660084824E-2,0.12307364333231419,42,{"$f":"BF27+BF29+BF34+BF36","v":824},{"$f":"BG27+BG29+BG34+BG36","v":1010},{"$f":"BH27+BH29+BH34+BH36","v":497},7.6673866090712736E-2,{"$f":"BJ27+BJ29+BJ34+BJ36","v":6482},11616,6418,4064,4,746,1151,453,295,255,230,1160,353,0.30431034482758623,110,"n/a",754,2.7377364656330561E-2,{"$f":"CB27+CB29+CB34+CB36","v":360},{"$f":"CC27+CC29+CC34+CC36","v":350},385,{"$f":"CE27+CE29+CE34+CE36","v":355},1100,0.11094513888888891,1170,0.1074292497625831,1160,0.11869088669950739,1120,0.11345312500000002,1165,0.10439686797465766,1010,9.8344693281402148E-2,{"$f":"CR27+CR29+CR34+CR36","v":467},{"$f":"CS27+CS29+CS34+CS36","v":27},{"$f":"CT27+CT29+CT34+CT36","v":440},0.94218415417558887,{"$f":"CV27+CV29+CV34+CV36","v":186},{"$f":"CW27+CW29+CW34+CW36","v":237},0.42272727272727273,0.53863636363636369,0.37743387164863429,0.46935826854331869,0.49192365034079505,0.58468027956322843,{"$f":"DD27+DD29+DD34+DD36","v":514},{"$f":"DE27+DE29+DE34+DE36","v":53},0.10311284046692606,7.96997006668584E-2,0.13241436812717267,"No Sig diff",{"$f":"DJ27+DJ29+DJ34+DJ36","v":492},{"$f":"DK27+DK29+DK34+DK36","v":42},8.5365853658536592E-2,6.3774524361247434E-2,0.1133818171629479,"No Sig diff",{"$f":"DP27+DP29+DP34+DP36","v":514},{"$f":"DQ27+DQ29+DQ34+DQ36","v":34},6.6147859922178989E-2,4.7719133057398534E-2,9.1013402928233483E-2,"Sig better than Eng.",{"$f":"DV27+DV29+DV34+DV36","v":537},{"$f":"DW27+DW29+DW34+DW36","v":51},9.4972067039106142E-2,7.2973712657176823E-2,0.12272404145265352,"No Sig diff",{"$f":"EB27+EB29+EB34+EB36","v":429},{"$f":"EC27+EC29+EC34+EC36","v":69},0.16083916083916083,0.12910851511118659,0.19858989716001957,"No Sig diff",{"$f":"EH27+EH29+EH34+EH36","v":415},{"$f":"EI27+EI29+EI34+EI36","v":72},0.17349397590361446,0.14010007304062752,0.21287706355172928,"No Sig diff",{"$f":"EN27+EN29+EN34+EN36","v":402},{"$f":"EO27+EO29+EO34+EO36","v":56},0.13930348258706468,0.1088570113409154,0.17657824004347888,"Sig better than Eng.",{"$f":"ET27+ET29+ET34+ET36","v":419},{"$f":"EU27+EU29+EU34+EU36","v":56},0.13365155131264916,0.10437604898695384,0.16958350820447257,"Sig better than Eng.",623,349,0.56019261637239171,0.5209649959575825,0.59868248259481094,623,34,124,24.91935483870968,0.26707779886148003,632,377,0.59651898734177211,0.55779872368700945,0.6340730051969099,632,34,126,24.238095238095237,0.28711484593837538,{"$f":"FT27+FT29+FT34+FT36","v":11169},{"$f":"FU27+FU29+FU34+FU36","v":10239},{"$f":"FV27+FV29+FV34+FV36","v":930},{"$f":"FW27+FW29+FW34+FW36","v":787},{"$f":"FX27+FX29+FX34+FX36","v":143},0.84623655913978491,0.15376344086021507,null,null,null,null,null,null,null,null,null,null,null,null,null,null,null,null,{"$f":"GQ27+GQ29+GQ34+GQ36","v":136},127,128,131,128,118,109,114,109,114,114,107,115,148,127,123,121,122,124,116,132,122,128,41,1.3385569702905649E-2,4708,4323,385,8.1775700934579434E-2]
["CFC Group - Crawley",null,"n/a","CFC Group - Crawley","Crawley",null,"n/a","n/a","n/a","Crawley","Crawley",98885,99705,100745,101610,102825,103845,105480,107055,108300,108970,6305,6280,6370,6595,6935,7190,7740,8145,8320,8355,0.62205700123915741,6.5675340768277565E-2,7.6827757125154897E-2,0.17348203221809169,4.8946716232961589E-2,1.3011152416356878E-2,0.37794299876084264,14546,0.49099408772171044,0.31527567716210642,0.19373023511618315,{"$f":"AQ4+AQ8+AQ22+AQ24+AQ28+AQ37","v":1545},1666,1694,1617,1621,69,75,79,{"$f":"AY4+AY8+AY22+AY24+AY28+AY37","v":67},64,128,7.8963602714373846E-2,6.6808520694543738E-2,9.3109517714746015E-2,144,{"$f":"BF4+BF8+BF22+BF24+BF28+BF37","v":2712},{"$f":"BG4+BG8+BG22+BG24+BG28+BG37","v":2241},{"$f":"BH4+BH8+BH22+BH24+BH28+BH37","v":1333},9.5071678196990222E-2,{"$f":"BJ4+BJ8+BJ22+BJ24+BJ28+BJ37","v":14021},24916,14216,7467,9,1897,3347,1496,1180,1095,925,3293,1363,0.4139082903127847,248,"n/a",2084,4.8774779413485618E-2,{"$f":"CB4+CB8+CB22+CB24+CB28+CB37","v":1650},{"$f":"CC4+CC8+CC22+CC24+CC28+CC37","v":1650},1580,{"$f":"CE4+CE8+CE22+CE24+CE28+CE37","v":1475},3775,0.19,3775,0.187,4090,0.19500000000000001,4165,0.19500000000000001,4165,0.19,3895,0.17399999999999999,{"$f":"CR4+CR8+CR22+CR24+CR28+CR37","v":1542},{"$f":"CS4+CS8+CS22+CS24+CS28+CS37","v":48},{"$f":"CT4+CT8+CT22+CT24+CT28+CT37","v":1494},0.9688715953307393,{"$f":"CV4+CV8+CV22+CV24+CV28+CV37","v":540},{"$f":"CW4+CW8+CW22+CW24+CW28+CW37","v":809},0.36144578313253012,0.54149933065595712,0.3374688957422961,0.38613336031626067,0.51615878957366523,0.56662700812860278,{"$f":"DD4+DD8+DD22+DD24+DD28+DD37","v":1053},{"$f":"DE4+DE8+DE22+DE24+DE28+DE37","v":91},8.6419753086419748E-2,7.0916108024578983E-2,0.10493000140802267,"No Sig diff",{"$f":"DJ4+DJ8+DJ22+DJ24+DJ28+DJ37","v":1172},{"$f":"DK4+DK8+DK22+DK24+DK28+DK37","v":114},9.7269624573378843E-2,8.1597122865939342E-2,0.11557355612442274,"No Sig diff",{"$f":"DP4+DP8+DP22+DP24+DP28+DP37","v":991},{"$f":"DQ4+DQ8+DQ22+DQ24+DQ28+DQ37","v":81},8.1735620585267413E-2,6.6250292754922335E-2,0.10045110207565305,"No Sig diff",{"$f":"DV4+DV8+DV22+DV24+DV28+DV37","v":1189},{"$f":"DW4+DW8+DW22+DW24+DW28+DW37","v":111},9.3355761143818342E-2,7.8103523781505702E-2,0.11122713466490082,"No Sig diff",{"$f":"EB4+EB8+EB22+EB24+EB28+EB37","v":1018},{"$f":"EC4+EC8+EC22+EC24+EC28+EC37","v":197},0.19351669941060903,0.17041930878054676,0.2189184455124161,"No Sig diff",{"$f":"EH4+EH8+EH22+EH24+EH28+EH37","v":1114},{"$f":"EI4+EI8+EI22+EI24+EI28+EI37","v":192},0.17235188509874327,0.15130866125267942,0.19564703247321,"No Sig diff",{"$f":"EN4+EN8+EN22+EN24+EN28+EN37","v":1128},{"$f":"EO4+EO8+EO22+EO24+EO28+EO37","v":213},0.18882978723404256,0.16706083594111637,0.21271095583311433,"No Sig diff",{"$f":"ET4+ET8+ET22+ET24+ET28+ET37","v":1075},{"$f":"EU4+EU8+EU22+EU24+EU28+EU37","v":210},0.19534883720930232,0.17275073315918471,0.22011649988542298,"No Sig diff",1440,693,0.48125000000000001,0.45552756226071045,0.50707220957012045,1440,34,288,22.378472222222197,0.34180964052287655,1518,841,0.5540184453227931,0.52890795807318758,0.57885622396393932,1518,34,301,22.714285714285719,0.33193277310924357,{"$f":"FT4+FT8+FT22+FT24+FT28+FT37","v":13718},{"$f":"FU4+FU8+FU22+FU24+FU28+FU37","v":13516},{"$f":"FV4+FV8+FV22+FV24+FV28+FV37","v":202},{"$f":"FW4+FW8+FW22+FW24+FW28+FW37","v":173},{"$f":"FX4+FX8+FX22+FX24+FX28+FX37","v":29},0.85643564356435642,0.14356435643564355,null,null,null,null,null,null,null,null,null,null,null,null,null,null,null,null,{"$f":"GQ4+GQ8+GQ22+GQ24+GQ28+GQ37","v":436},417,418,430,423,408,396,389,394,393,396,395,402,420,394,383,376,384,394,378,399,379,391,158,1.9602977667493797E-2,12900,11233,1667,0.12922480620155039]
["CFC Group - Horsham Rural",null,"n/a","CFC Group - Horsham Rural","Horsham",null,"n/a","n/a","n/a","Coastal/Horsham and Mid Sussex","Arundel and South Downs/Horsham",77760,78225,78800,79500,79860,80135,80945,81165,81415,81900,3925,3885,3805,3970,3935,3890,3940,3945,3960,3985,0.92874999999999996,2.8750000000000001E-2,0.03,1.125E-2,1.25E-3,1.25E-3,7.1249999999999994E-2,8282,0.70816227964259837,0.1390968365129196,0.15274088384448201,{"$f":"AQ5+AQ32+AQ33+AQ40","v":694},711,686,680,643,31,23,15,{"$f":"AY5+AY32+AY33+AY40","v":26},21,48,7.4650077760497674E-2,5.6764926583491651E-2,9.7587360919419316E-2,41,{"$f":"BF5+BF32+BF33+BF40","v":1116},{"$f":"BG5+BG32+BG33+BG40","v":1375},{"$f":"BH5+BH32+BH33+BH40","v":609},6.734490766338605E-2,{"$f":"BJ5+BJ32+BJ33+BJ40","v":9043},16084,9447,6288,1,1076,1520,562,305,275,245,1392,396,0.28448275862068967,150,"n/a",791,2.3278399058269571E-2,{"$f":"CB5+CB32+CB33+CB40","v":460},{"$f":"CC5+CC32+CC33+CC40","v":430},395,{"$f":"CE5+CE32+CE33+CE40","v":415},1210,8.6488636363636365E-2,1290,8.4399547803617567E-2,1345,9.603960140437838E-2,1205,9.1512966804979251E-2,1230,8.5441734417344178E-2,1040,7.6999999999999999E-2,{"$f":"CR5+CR32+CR33+CR40","v":694},{"$f":"CS5+CS32+CS33+CS40","v":20},{"$f":"CT5+CT32+CT33+CT40","v":674},0.97118155619596547,{"$f":"CV5+CV32+CV33+CV40","v":308},{"$f":"CW5+CW32+CW33+CW40","v":404},0.45697329376854601,0.59940652818991103,0.41971558496913836,0.49471868392183771,0.56194988661152023,0.63573645767484521,{"$f":"DD5+DD32+DD33+DD40","v":690},{"$f":"DE5+DE32+DE33+DE40","v":45},6.5217391304347824E-2,4.9095601119040551E-2,8.6153536313874207E-2,"Sig better than Eng.",{"$f":"DJ5+DJ32+DJ33+DJ40","v":715},{"$f":"DK5+DK32+DK33+DK40","v":60},8.3916083916083919E-2,6.5749511211531414E-2,0.10652972686116412,"No Sig diff",{"$f":"DP5+DP32+DP33+DP40","v":478},{"$f":"DQ5+DQ32+DQ33+DQ40","v":37},7.7405857740585768E-2,5.6677309110696433E-2,0.1048726310111248,"No Sig diff",{"$f":"DV5+DV32+DV33+DV40","v":661},{"$f":"DW5+DW32+DW33+DW40","v":53},8.0181543116490173E-2,6.1822013381150641E-2,0.10339250109201802,"No Sig diff",{"$f":"EB5+EB32+EB33+EB40","v":715},{"$f":"EC5+EC32+EC33+EC40","v":109},0.15244755244755245,0.12796234517942864,0.18064737132835237,"Sig better than Eng.",{"$f":"EH5+EH32+EH33+EH40","v":683},{"$f":"EI5+EI32+EI33+EI40","v":102},0.14934114202049781,0.12457477402504541,0.17802993358471017,"Sig better than Eng.",{"$f":"EN5+EN32+EN33+EN40","v":653},{"$f":"EO5+EO32+EO33+EO40","v":89},0.13629402756508421,0.11209652965952474,0.1647457073502642,"Sig better than Eng.",{"$f":"ET5+ET32+ET33+ET40","v":591},{"$f":"EU5+EU32+EU33+EU40","v":74},0.12521150592216582,0.10092567436312364,0.15433807124352619,"Sig better than Eng.",782,456,0.58312020460358061,0.54823960073443256,0.61718816913035668,782,34,156,25.679487179487179,0.24472096530920062,838,521,0.62171837708830546,0.5883987373583377,0.65392717551102397,838,34,166,26.8132530120482,0.21137491141034706,{"$f":"FT5+FT32+FT33+FT40","v":12075},{"$f":"FU5+FU32+FU33+FU40","v":11826},{"$f":"FV5+FV32+FV33+FV40","v":249},{"$f":"FW5+FW32+FW33+FW40","v":205},{"$f":"FX5+FX32+FX33+FX40","v":44},0.82329317269076308,0.17670682730923695,null,null,null,null,null,null,null,null,null,null,null,null,null,null,null,null,{"$f":"GQ5+GQ32+GQ33+GQ40","v":214},209,210,210,210,164,154,157,154,158,159,154,158,206,197,194,189,193,197,189,194,191,201,60,1.5018773466833541E-2,6263,5821,442,7.0573207727925913E-2]
["CFC Group - Horsham Town",null,"n/a","CFC Group - Horsham Town","Horsham",null,"n/a","n/a","n/a","Horsham and Mid Sussex","Horsham",55555,56115,56850,57335,57750,58185,58650,59080,59530,59735,3470,3325,3330,3430,3440,3490,3565,3600,3660,3595,0.86153846153846159,3.3566433566433566E-2,5.4545454545454543E-2,3.9160839160839164E-2,6.993006993006993E-3,2.7972027972027972E-3,0.13706293706293707,6989,0.70553727285734724,0.14179424810416369,0.15266847903848904,{"$f":"AQ19+AQ38+AQ30+AQ43","v":701},648,690,636,632,23,19,9,{"$f":"AY19+AY38+AY30+AY43","v":13},7,40,6.3291139240506333E-2,4.6821004663438637E-2,8.5038058091286881E-2,21,{"$f":"BF19+BF38+BF30+BF43","v":1043},{"$f":"BG19+BG38+BG30+BG43","v":1201},{"$f":"BH19+BH38+BH30+BH43","v":501},6.8172540481698185E-2,{"$f":"BJ19+BJ38+BJ30+BJ43","v":7349},13050,7079,4683,7,790,1140,459,270,260,225,1167,322,0.27592116538131961,120,"n/a",755,3.0908421009538625E-2,{"$f":"CB19+CB38+CB30+CB43","v":375},{"$f":"CC19+CC38+CC30+CC43","v":385},390,{"$f":"CE19+CE38+CE30+CE43","v":375},975,9.1210268250268262E-2,985,8.4665036148284883E-2,1005,9.1542223945209028E-2,935,8.8974442669629838E-2,1000,8.7870851370851363E-2,920,8.4000000000000005E-2,{"$f":"CR19+CR38+CR30+CR43","v":617},{"$f":"CS19+CS38+CS30+CS43","v":16},{"$f":"CT19+CT38+CT30+CT43","v":601},0.97406807131280393,{"$f":"CV19+CV38+CV30+CV43","v":283},{"$f":"CW19+CW38+CW30+CW43","v":368},0.47088186356073214,0.61231281198003329,0.4312868407625195,0.51084675558809745,0.57276407466122725,0.65043491084353611,{"$f":"DD19+DD38+DD30+DD43","v":584},{"$f":"DE19+DE38+DE30+DE43","v":40},6.8493150684931503E-2,5.0700192152736974E-2,9.1925778783191525E-2,"Sig better than Eng.",{"$f":"DJ19+DJ38+DJ30+DJ43","v":606},{"$f":"DK19+DK38+DK30+DK43","v":41},6.7656765676567657E-2,5.0261484259510152E-2,9.0498802826732824E-2,"Sig better than Eng.",{"$f":"DP19+DP38+DP30+DP43","v":390},{"$f":"DQ19+DQ38+DQ30+DQ43","v":35},8.9743589743589744E-2,6.5235527450921732E-2,0.12225478665110948,"No Sig diff",{"$f":"DV19+DV38+DV30+DV43","v":568},{"$f":"DW19+DW38+DW30+DW43","v":39},6.8661971830985921E-2,5.0631690526542664E-2,9.2487451253550318E-2,"No Sig diff",{"$f":"EB19+EB38+EB30+EB43","v":593},{"$f":"EC19+EC38+EC30+EC43","v":79},0.13322091062394603,0.10821751503531322,0.16294571672220998,"Sig better than Eng.",{"$f":"EH19+EH38+EH30+EH43","v":630},{"$f":"EI19+EI38+EI30+EI43","v":88},0.13968253968253969,0.11479084888788295,0.16894170965333588,"Sig better than Eng.",{"$f":"EN19+EN38+EN30+EN43","v":603},{"$f":"EO19+EO38+EO30+EO43","v":68},0.11276948590381426,8.9935057926732356E-2,0.14050644666732612,"Sig better than Eng.",{"$f":"ET19+ET38+ET30+ET43","v":580},{"$f":"EU19+EU38+EU30+EU43","v":72},0.12413793103448276,9.9750144188588658E-2,0.15347178205029172,"Sig better than Eng.",673,392,0.58246656760772664,0.54484327168467928,0.61915377452670772,673,34,134,25.253731343283587,0.25724319578577687,751,468,0.62316910785619173,0.58796684159232548,0.65711773588839439,751,34,150,24.599999999999994,0.2764705882352943,{"$f":"FT19+FT38+FT30+FT43","v":9632},{"$f":"FU19+FU38+FU30+FU43","v":9400},{"$f":"FV19+FV38+FV30+FV43","v":232},{"$f":"FW19+FW38+FW30+FW43","v":203},{"$f":"FX19+FX38+FX30+FX43","v":29},0.875,0.125,null,null,null,null,null,null,null,null,null,null,null,null,null,null,null,null,{"$f":"GQ19+GQ38+GQ30+GQ43","v":181},173,173,176,173,189,180,174,180,175,178,181,181,168,155,152,147,151,158,145,158,154,156,67,1.8799102132435467E-2,5540,5172,368,6.6425992779783394E-2]
["CFC Group - Mid Sussex",null,"n/a","CFC Group - Mid Sussex","Mid Sussex",null,"n/a","n/a","n/a","Horsham and Mid Sussex","Mid Sussex",129460,130505,132060,133975,135735,137210,138895,140190,141160,142765,7400,7450,7665,7985,8155,8140,8240,8325,8490,8560,0.87477531455961655,3.8945476333133611E-2,4.0143798681845415E-2,3.9544637507489516E-2,5.3924505692031152E-3,5.9916117435590175E-4,0.12522468544038345,16498,0.71044975148502854,0.12456055279427809,0.16498969572069341,{"$f":"AQ12+AQ13+AQ17+AQ18+AQ26+AQ35+AQ41+AQ42","v":1463},1513,1518,1502,1486,48,48,43,{"$f":"AY12+AY13+AY17+AY18+AY26+AY35+AY41+AY42","v":28},36,74,4.9798115746971738E-2,3.9852422821900144E-2,6.2065440935822419E-2,70,{"$f":"BF12+BF13+BF17+BF18+BF26+BF35+BF41+BF42","v":2421},{"$f":"BG12+BG13+BG17+BG18+BG26+BG35+BG41+BG42","v":2796},{"$f":"BH12+BH13+BH17+BH18+BH26+BH35+BH41+BH42","v":1278},7.5216290977576358E-2,{"$f":"BJ12+BJ13+BJ17+BJ18+BJ26+BJ35+BJ41+BJ42","v":16991},30486,17136,11373,9,2041,2699,1014,530,540,445,2645,656,0.24801512287334593,222,"n/a",1360,2.3689665383476458E-2,{"$f":"CB12+CB13+CB17+CB18+CB26+CB35+CB41+CB42","v":740},{"$f":"CC12+CC13+CC17+CC18+CC26+CC35+CC41+CC42","v":770},785,{"$f":"CE12+CE13+CE17+CE18+CE26+CE35+CE41+CE42","v":691},2145,8.6999999999999994E-2,2025,8.2000000000000003E-2,2235,8.8999999999999996E-2,2140,8.5000000000000006E-2,2130,8.4000000000000005E-2,1955,7.6999999999999999E-2,{"$f":"CR12+CR13+CR17+CR18+CR26+CR35+CR41+CR42","v":1479},{"$f":"CS12+CS13+CS17+CS18+CS26+CS35+CS41+CS42","v":37},{"$f":"CT12+CT13+CT17+CT18+CT26+CT35+CT41+CT42","v":1442},0.9749830966869506,{"$f":"CV12+CV13+CV17+CV18+CV26+CV35+CV41+CV42","v":703},{"$f":"CW12+CW13+CW17+CW18+CW26+CW35+CW41+CW42","v":902},0.48751733703190014,0.62552011095700422,0.46178594193552791,0.51331506254848824,0.60023713947888135,0.65013609320962285,{"$f":"DD12+DD13+DD17+DD18+DD26+DD35+DD41+DD42","v":1206},{"$f":"DE12+DE13+DE17+DE18+DE26+DE35+DE41+DE42","v":69},5.721393034825871E-2,4.5457515173171009E-2,7.1782192382359139E-2,"Sig better than Eng.",{"$f":"DJ12+DJ13+DJ17+DJ18+DJ26+DJ35+DJ41+DJ42","v":1330},{"$f":"DK12+DK13+DK17+DK18+DK26+DK35+DK41+DK42","v":79},5.9398496240601506E-2,4.7919231091123504E-2,7.341562302548571E-2,"Sig better than Eng.",{"$f":"DP12+DP13+DP17+DP18+DP26+DP35+DP41+DP42","v":1348},{"$f":"DQ12+DQ13+DQ17+DQ18+DQ26+DQ35+DQ41+DQ42","v":69},5.118694362017804E-2,4.0645524866629167E-2,6.4279100647099616E-2,"Sig better than Eng.",{"$f":"DV12+DV13+DV17+DV18+DV26+DV35+DV41+DV42","v":1303},{"$f":"DW12+DW13+DW17+DW18+DW26+DW35+DW41+DW42","v":90},6.9071373752877974E-2,5.653171765493481E-2,8.4144458158001506E-2,"Sig better than Eng.",{"$f":"EB12+EB13+EB17+EB18+EB26+EB35+EB41+EB42","v":1204},{"$f":"EC12+EC13+EC17+EC18+EC26+EC35+EC41+EC42","v":172},0.14285714285714285,0.1242260956758479,0.16375992788747454,"Sig better than Eng.",{"$f":"EH12+EH13+EH17+EH18+EH26+EH35+EH41+EH42","v":1143},{"$f":"EI12+EI13+EI17+EI18+EI26+EI35+EI41+EI42","v":142},0.1242344706911636,0.10636144655299956,0.14462482239186727,"Sig better than Eng.",{"$f":"EN12+EN13+EN17+EN18+EN26+EN35+EN41+EN42","v":1187},{"$f":"EO12+EO13+EO17+EO18+EO26+EO35+EO41+EO42","v":158},0.13310867733782644,0.11496263618686223,0.15362178069885599,"Sig better than Eng.",{"$f":"ET12+ET13+ET17+ET18+ET26+ET35+ET41+ET42","v":1154},{"$f":"EU12+EU13+EU17+EU18+EU26+EU35+EU41+EU42","v":133},0.11525129982668977,9.8090404106502271E-2,0.13496521569790343,"Sig better than Eng.",1637,947,0.57849725106902872,0.55442004800520173,0.60220690618250572,1637,34,327,25.431192660550472,0.25202374527792726,1614,1025,0.63506815365551428,0.61128697123654441,0.65820791506573717,1614,34,320,26.740624999999991,0.21351102941176497,{"$f":"FT12+FT13+FT17+FT18+FT26+FT35+FT41+FT42","v":22188},{"$f":"FU12+FU13+FU17+FU18+FU26+FU35+FU41+FU42","v":21777},{"$f":"FV12+FV13+FV17+FV18+FV26+FV35+FV41+FV42","v":411},{"$f":"FW12+FW13+FW17+FW18+FW26+FW35+FW41+FW42","v":362},{"$f":"FX12+FX13+FX17+FX18+FX26+FX35+FX41+FX42","v":49},0.88077858880778592,0.11922141119221411,null,null,null,null,null,null,null,null,null,null,null,null,null,null,null,null,{"$f":"GQ12+GQ13+GQ17+GQ18+GQ26+GQ35+GQ41+GQ42","v":397},380,381,383,381,441,409,410,403,413,421,411,422,492,456,453,440,455,457,430,463,453,460,140,1.6794625719769675E-2,13214,12411,803,6.0768881489329497E-2]
["CFC Group - Worthing",null,"n/a","CFC Group - Worthing","Worthing",null,"n/a","n/a","n/a","Coastal West Sussex","East Worthing and Shoreham/Worthing",106385,106970,107615,108555,109370,109795,110865,112025,112725,113170,5555,5620,5730,5915,6175,6205,6365,6570,6540,6395,0.84790874524714832,3.2699619771863121E-2,6.2357414448669199E-2,4.4106463878326993E-2,7.6045627376425855E-3,3.8022813688212928E-3,0.15133079847908745,12349,0.63632682808324559,0.12438254109644506,0.23929063082030932,{"$f":"AQ10+AQ15+AQ16+AQ25+AQ45+AQ47","v":1223},1179,1292,1197,1141,67,65,52,{"$f":"AY10+AY15+AY16+AY25+AY45+AY47","v":53},46,70,6.1349693251533742E-2,4.8843255749594285E-2,7.6799869516733704E-2,99,{"$f":"BF10+BF15+BF16+BF25+BF45+BF47","v":2106},{"$f":"BG10+BG15+BG16+BG25+BG45+BG47","v":2016},{"$f":"BH10+BH15+BH16+BH25+BH45+BH47","v":959},7.5954379851100901E-2,{"$f":"BJ10+BJ15+BJ16+BJ25+BJ45+BJ47","v":12626},22122,12498,7090,8,1731,2743,926,850,780,585,2898,1015,0.35024154589371981,295,"n/a",2423,4.8062046256992105E-2,{"$f":"CB10+CB15+CB16+CB25+CB45+CB47","v":1110},{"$f":"CC10+CC15+CC16+CC25+CC45+CC47","v":1095},1100,{"$f":"CE10+CE15+CE16+CE25+CE45+CE47","v":985},2775,0.157,2635,0.14799999999999999,2915,0.161,2865,0.157,2740,0.152,2460,0.13300000000000001,{"$f":"CR10+CR15+CR16+CR25+CR45+CR47","v":1193},{"$f":"CS10+CS15+CS16+CS25+CS45+CS47","v":54},{"$f":"CT10+CT15+CT16+CT25+CT45+CT47","v":1139},0.95473595976529757,{"$f":"CV10+CV15+CV16+CV25+CV45+CV47","v":471},{"$f":"CW10+CW15+CW16+CW25+CW45+CW47","v":617},0.41352063213345042,0.54170324846356455,0.3852582632790188,0.44236437109470655,0.51267528026756404,0.57045086051668015,{"$f":"DD10+DD15+DD16+DD25+DD45+DD47","v":829},{"$f":"DE10+DE15+DE16+DE25+DE45+DE47","v":68},8.2026537997587454E-2,6.5218698302625541E-2,0.10269016038785084,"No Sig diff",{"$f":"DJ10+DJ15+DJ16+DJ25+DJ45+DJ47","v":1066},{"$f":"DK10+DK15+DK16+DK25+DK45+DK47","v":86},8.0675422138836772E-2,6.5792774479139837E-2,9.856939093416113E-2,"No Sig diff",{"$f":"DP10+DP15+DP16+DP25+DP45+DP47","v":1024},{"$f":"DQ10+DQ15+DQ16+DQ25+DQ45+DQ47","v":76},7.421875E-2,5.9706323437482188E-2,9.1913809690345377E-2,"Sig better than Eng.",{"$f":"DV10+DV15+DV16+DV25+DV45+DV47","v":1216},{"$f":"DW10+DW15+DW16+DW25+DW45+DW47","v":109},8.9638157894736836E-2,7.484783954991038E-2,0.10701305492662574,"No Sig diff",{"$f":"EB10+EB15+EB16+EB25+EB45+EB47","v":936},{"$f":"EC10+EC15+EC16+EC25+EC45+EC47","v":136},0.14529914529914531,0.12417242623970695,0.16932543580057574,"Sig better than Eng.",{"$f":"EH10+EH15+EH16+EH25+EH45+EH47","v":957},{"$f":"EI10+EI15+EI16+EI25+EI45+EI47","v":155},0.16196447230929989,0.13998174091720603,0.18665014610179606,"Sig better than Eng.",{"$f":"EN10+EN15+EN16+EN25+EN45+EN47","v":920},{"$f":"EO10+EO15+EO16+EO25+EO45+EO47","v":136},0.14782608695652175,0.12635666559262351,0.1722242826718248,"Sig better than Eng.",{"$f":"ET10+ET15+ET16+ET25+ET45+ET47","v":913},{"$f":"EU10+EU15+EU16+EU25+EU45+EU47","v":142},0.15553121577217963,0.13347157187867184,0.18047742775637524,"Sig better than Eng.",1347,734,0.54491462509279887,0.51823096411520353,0.57134283391260865,1347,34,269,25.000000000000004,0.26470588235294107,1275,778,0.61019607843137258,0.58313310248936623,0.63659702751371405,1275,34,252,25.519841269841287,0.24941643323996215,{"$f":"FT10+FT15+FT16+FT25+FT45+FT47","v":15545},{"$f":"FU10+FU15+FU16+FU25+FU45+FU47","v":15138},{"$f":"FV10+FV15+FV16+FV25+FV45+FV47","v":407},{"$f":"FW10+FW15+FW16+FW25+FW45+FW47","v":335},{"$f":"FX10+FX15+FX16+FX25+FX45+FX47","v":72},0.82309582309582308,0.1769041769041769,null,null,null,null,null,null,null,null,null,null,null,null,null,null,null,null,{"$f":"GQ10+GQ15+GQ16+GQ25+GQ45+GQ47","v":281},273,271,279,275,336,320,323,318,324,328,317,327,360,337,325,317,330,337,326,342,331,340,120,1.827875095201828E-2,10048,8846,1202,0.11962579617834394]
["LA - Adur",null,"n/a","n/a","Adur",null,"n/a","n/a","n/a","Coastal West Sussex","n/a",60000,59800,60300,60600,60700,61000,61200,61300,61900,62500,3100,3000,3100,3200,3200,3400,3400,3600,3700,3800,0.89674681753889673,2.8288543140028287E-2,4.2432814710042434E-2,2.2630834512022632E-2,4.2432814710042432E-3,8.4865629420084864E-3,0.10466760961810467,6645,0.6155003762227238,0.17757712565838976,0.20692249811888638,682,718,679,775,758,43,42,29,37,26,"n/a","n/a","n/a","n/a","n/a",null,null,null,null,null,null,null,null,null,null,null,null,null,null,null,1614,637,0.39467162329615862,158,"n/a",1300,4.8224950847646254E-2,{"$f":"SUMIF($E$3:$E$47,$E60,CB$3:CB$47)","v":760},715,735,680,1900,0.182,1820,0.17499999999999999,1960,0.187,1795,0.17199999999999999,1785,0.17,1720,0.161,{"$f":"SUMIF($E$3:$E$47,$E60,CR$3:CR$47)","v":698},46,652,0.93409742120343842,{"$f":"SUMIF($E$3:$E$47,$E60,CV$3:CV$47)","v":255},329,{"$f":"CV60/CR60","v":0.3653295128939828},{"$f":"CW60/CR60","v":0.47134670487106017},0.35438810491980105,0.42909619982695479,0.46630869412118858,0.54283985638246957,499,26.945999999999998,5.3999999999999999E-2,3.4000000000000002E-2,7.3999999999999996E-2,"Sig better than Eng.",612,612.07799999999997,7.8E-2,5.6999999999999995E-2,9.9000000000000005E-2,"No Sig diff",536,55.744,0.104,7.8E-2,0.13,"No Sig diff",639,56.870999999999995,8.8999999999999996E-2,6.7000000000000004E-2,0.11099999999999999,"No Sig diff",517,87.89,0.17,0.13800000000000001,0.20200000000000001,"No Sig diff",523,87.864000000000004,0.16800000000000001,0.13600000000000001,0.2,"No Sig diff",486,83.106000000000009,0.17100000000000001,0.13800000000000001,0.20400000000000001,"No Sig diff",518,89.095999999999989,0.17199999999999999,0.16869999999999999,0.20499999999999999,"No Sig diff",688,340,0.4941860465116279,0.45696323963020558,0.53147341749983013,688,34,137,22.175182481751833,0.34778875053671082,654,370,0.56574923547400613,0.52748685508392112,0.60324373181793112,654,34,130,23.223076923076924,0.31696832579185519,{"$f":"SUMIF($E$3:$E$47,$E60,FT$3:FT$47)","v":8055},7928,127,112,15,0.88188976377952755,0.11811023622047244,null,null,null,null,null,null,null,null,null,null,null,null,null,null,null,null,"n/a","n/a","n/a","n/a","n/a","n/a","n/a","n/a","n/a","n/a","n/a","n/a","n/a","n/a","n/a","n/a","n/a","n/a","n/a","n/a","n/a","n/a","n/a",82,2.3196605374823195E-2,5509,4805,704,0.12779088763840987]
["LA - Arun",null,"n/a","n/a","Arun",null,"n/a","n/a","n/a","Coastal West Sussex","n/a",145100,146000,146800,147700,148500,148900,149500,149800,151400,152800,6700,6800,6800,6900,7000,7300,7300,7500,7800,8000,0.87542315504400814,6.8381855111712936E-2,3.2498307379823968E-2,2.0311442112389978E-2,2.7081922816519972E-3,2.031144211238998E-3,0.12457684495599188,14349,0.60241131786187185,0.12544428183148651,0.27214440030664155,1435,1496,1567,1619,1493,109,76,101,76,77,"n/a","n/a","n/a","n/a","n/a",null,null,null,null,null,null,null,null,null,null,null,null,null,null,null,3519,1200,0.34100596760443308,332,"n/a",2878,4.3144544718616014E-2,1315,1375,1465,1430,4085,0.17299999999999999,3835,0.16300000000000001,4050,0.17100000000000001,3845,0.16200000000000001,3880,0.16300000000000001,3620,0.15,1513,57,1456,0.96232650363516192,562,696,0.37144745538664903,0.46001321877065432,0.3613137692115862,0.41126429679228704,0.45245537548645942,0.5037042516950101,1142,102.78,0.09,7.2999999999999995E-2,0.107,"No Sig diff",1241,1241.085,8.5000000000000006E-2,6.9000000000000006E-2,0.10100000000000001,"No Sig diff",1158,119.27399999999999,0.10299999999999999,8.5999999999999993E-2,0.12,"No Sig diff",1432,140.33600000000001,9.8000000000000004E-2,8.3000000000000004E-2,0.113,"No Sig diff",1236,196.524,0.159,0.13900000000000001,0.17899999999999999,"Sig better than Eng.",1196,218.86799999999999,0.183,0.161,0.20499999999999999,"No Sig diff",1187,214.84699999999998,0.18099999999999999,0.159,0.20299999999999999,"No Sig diff",1199,183.447,0.153,0.13300000000000001,0.17299999999999999,"Sig better than Eng.",1542,715,0.46368352788586253,0.43891441899559364,0.48863313165333022,1542,33,308,22.461038961038945,0.31936245572609256,1589,889,0.55947136563876654,0.53494728540455549,0.58370859145837573,1589,34,317,23.64984227129338,0.30441640378548884,18212,17593,619,489,130,0.78998384491114704,0.21001615508885299,null,null,null,null,null,null,null,null,null,null,null,null,null,null,null,null,"n/a","n/a","n/a","n/a","n/a","n/a","n/a","n/a","n/a","n/a","n/a","n/a","n/a","n/a","n/a","n/a","n/a","n/a","n/a","n/a","n/a","n/a","n/a",150,2.0319696559198051E-2,11783,10387,1396,0.11847577017737418]
["LA - Chichester",null,"n/a","n/a","Chichester",null,"n/a","n/a","n/a","Coastal West Sussex","n/a",108200,108800,109700,110600,111800,112500,113400,114000,114500,115300,5000,5000,5200,5300,5500,5500,5700,5600,5900,5800,0.90707964601769908,3.1858407079646017E-2,2.743362831858407E-2,2.1238938053097345E-2,8.8495575221238937E-3,3.5398230088495575E-3,9.1150442477876112E-2,11231,0.5725224824147449,0.20470127326150833,0.22277624432374676,1131,1067,1134,1136,1046,59,55,48,51,50,"n/a","n/a","n/a","n/a","n/a",null,null,null,null,null,null,null,null,null,null,null,null,null,null,null,2288,731,0.31949300699300698,191,"n/a",1500,3.0091478093403949E-2,795,785,865,770,2305,0.126,2330,0.127,2425,0.13100000000000001,2340,0.126,2230,0.12,2100,0.113,919,67,852,0.92709466811751906,376,480,0.40914036996735581,0.52230685527747556,0.40830966009695818,0.47484628838696685,0.52986598333819934,0.5963255922991616,991,99.100000000000009,0.1,8.1000000000000003E-2,0.11900000000000001,"No Sig diff",956,956.07899999999995,7.9000000000000001E-2,6.2E-2,9.6000000000000002E-2,"No Sig diff",951,65.619,6.9000000000000006E-2,5.3000000000000005E-2,8.5000000000000006E-2,"Sig better than Eng.",988,83.98,8.5000000000000006E-2,6.8000000000000005E-2,0.10200000000000001,"No Sig diff",885,130.97999999999999,0.14799999999999999,0.125,0.17099999999999999,"Sig better than Eng.",801,129.762,0.16200000000000001,0.13600000000000001,0.188,"Sig better than Eng.",821,127.255,0.155,0.13,0.18,"Sig better than Eng.",831,108.861,0.13100000000000001,0.10800000000000001,0.154,"Sig better than Eng.",1138,610,0.53602811950790863,0.50698089567473048,0.5648329269593596,1138,34,227,22.969162995594704,0.32443638248250872,1158,658,0.56822107081174433,0.53951303675508588,0.59647797888690635,1158,34,231,23.199134199134214,0.31767252355487607,17647,16217,1430,1212,218,0.84755244755244752,0.15244755244755245,null,null,null,null,null,null,null,null,null,null,null,null,null,null,null,null,"n/a","n/a","n/a","n/a","n/a","n/a","n/a","n/a","n/a","n/a","n/a","n/a","n/a","n/a","n/a","n/a","n/a","n/a","n/a","n/a","n/a","n/a","n/a",89,1.5766164747564215E-2,8704,7913,791,9.087775735294118E-2]
["LA - Crawley",null,"n/a","n/a","Crawley",null,"n/a","n/a","n/a","Crawley","n/a",98900,99700,100700,101600,102800,103800,105500,107100,108300,109000,6300,6300,6400,6600,6900,7200,7700,8200,8300,8400,0.62205700123915741,6.5675340768277565E-2,7.6827757125154897E-2,0.17348203221809169,4.8946716232961589E-2,1.3011152416356878E-2,0.37608426270136308,14546,0.49099408772171044,0.31527567716210642,0.19373023511618315,1576,1716,1718,1648,1646,73,80,79,71,66,"n/a","n/a","n/a","n/a","n/a",null,null,null,null,null,null,null,null,null,null,null,null,null,null,null,3293,1363,0.4139082903127847,248,"n/a",2084,4.8774779413485618E-2,1650,1650,1580,1475,3775,0.19,3775,0.187,4090,0.19500000000000001,4165,0.19500000000000001,4165,0.19,3895,0.17399999999999999,1542,48,1494,0.9688715953307393,540,809,0.35019455252918286,0.52464332036316474,0.33746846270118325,0.3861338194092882,0.51615832316198718,0.56662746673729192,1032,86.688000000000002,8.4000000000000005E-2,6.7000000000000004E-2,0.10100000000000001,"No Sig diff",1178,1178.098,9.8000000000000004E-2,8.1000000000000003E-2,0.115,"No Sig diff",998,80.838000000000008,8.1000000000000003E-2,6.4000000000000001E-2,9.8000000000000004E-2,"No Sig diff",1197,111.321,9.2999999999999999E-2,7.6999999999999999E-2,0.109,"No Sig diff",1000,190,0.19,0.16600000000000001,0.214,"No Sig diff",1121,193.93299999999999,0.17299999999999999,0.151,0.19499999999999998,"No Sig diff",1131,212.62800000000001,0.188,0.16500000000000001,0.21099999999999999,"No Sig diff",1083,211.185,0.19500000000000001,0.17100000000000001,0.219,"No Sig diff",1440,693,0.48125000000000001,0.45552756226071045,0.50707220957012045,1440,34,288,22.378472222222197,0.34180964052287655,1518,841,0.5540184453227931,0.52890795807318758,0.57885622396393932,1518,34,303,22.61056105610562,0.33498349834983471,13718,13516,202,173,29,0.85643564356435642,0.14356435643564355,null,null,null,null,null,null,null,null,null,null,null,null,null,null,null,null,"n/a","n/a","n/a","n/a","n/a","n/a","n/a","n/a","n/a","n/a","n/a","n/a","n/a","n/a","n/a","n/a","n/a","n/a","n/a","n/a","n/a","n/a","n/a",158,1.9602977667493797E-2,12900,11233,1667,0.12922480620155039]
["LA - Horsham",null,"n/a","n/a","Horsham",null,"n/a","n/a","n/a","Coastal/Horsham and Mid Sussex","n/a",124900,125900,127200,128300,129100,129800,130900,131500,132200,132900,7000,6800,6700,7000,7000,7000,7100,7100,7200,7100,0.89580419580419579,3.2167832167832165E-2,4.1258741258741259E-2,2.5174825174825177E-2,4.1958041958041958E-3,2.0979020979020979E-3,0.10279720279720279,14358,0.70344059061150577,0.1424293077030227,0.1541301016854715,1368,1313,1308,1290,1261,49,35,21,34,31,"n/a","n/a","n/a","n/a","n/a",null,null,null,null,null,null,null,null,null,null,null,null,null,null,null,2460,693,0.2817073170731707,257,"n/a",1504,2.7383791854050217E-2,835,815,760,765,2155,9.1999999999999998E-2,2065,8.8999999999999996E-2,2275,9.8000000000000004E-2,2195,9.5000000000000001E-2,2095,9.0999999999999998E-2,1885,8.2000000000000003E-2,1311,36,1275,0.97254004576659037,591,772,0.45080091533180777,0.58886346300533943,0.43630751092380765,0.49097042560875431,0.578384057897111,0.63196255578827432,1215,82.62,6.8000000000000005E-2,5.4000000000000006E-2,8.2000000000000003E-2,"Sig better than Eng.",1230,1230.078,7.8E-2,6.3E-2,9.2999999999999999E-2,"No Sig diff",838,70.39200000000001,8.4000000000000005E-2,6.5000000000000002E-2,0.10300000000000001,"No Sig diff",1171,88.995999999999995,7.5999999999999998E-2,6.0999999999999999E-2,9.0999999999999998E-2,"Sig better than Eng.",1236,187.87199999999999,0.152,0.13200000000000001,0.17199999999999999,"Sig better than Eng.",1267,184.982,0.14599999999999999,0.127,0.16499999999999998,"Sig better than Eng.",1196,149.5,0.125,0.106,0.14399999999999999,"Sig better than Eng.",1110,135.41999999999999,0.122,0.10299999999999999,0.14099999999999999,"Sig better than Eng.",1370,798,0.58248175182481754,0.55617303817911246,0.60832920372731425,1370,34,274,25.514598540145979,0.24957063117217709,1498,936,0.62483311081441928,0.6000250238085405,0.64900259345652012,1498,34,299,25.789297658862878,0.24149124532756239,21707,21226,481,408,73,0.84823284823284828,0.15176715176715178,null,null,null,null,null,null,null,null,null,null,null,null,null,null,null,null,"n/a","n/a","n/a","n/a","n/a","n/a","n/a","n/a","n/a","n/a","n/a","n/a","n/a","n/a","n/a","n/a","n/a","n/a","n/a","n/a","n/a","n/a","n/a",120,1.6809076901526825E-2,11145,10372,773,6.935845670704352E-2]
["LA - Mid Sussex",null,"n/a","n/a","Mid Sussex",null,"n/a","n/a","n/a","Horsham and Mid Sussex","n/a",129500,130500,132100,134000,135700,137200,138900,140200,141200,142800,7400,7500,7700,8000,8100,8100,8200,8300,8500,8500,0.87477531455961655,3.8945476333133611E-2,4.0143798681845415E-2,3.9544637507489516E-2,5.3924505692031152E-3,5.9916117435590175E-4,0.12103055721989216,16498,0.71044975148502854,0.12456055279427809,0.16498969572069341,1479,1527,1524,1545,1512,46,43,42,28,39,"n/a","n/a","n/a","n/a","n/a",null,null,null,null,null,null,null,null,null,null,null,null,null,null,null,2645,656,0.24801512287334593,222,"n/a",1360,2.3689665383476458E-2,740,770,785,691,2145,8.6999999999999994E-2,2025,8.2000000000000003E-2,2235,8.8999999999999996E-2,2140,8.5000000000000006E-2,2130,8.4000000000000005E-2,1955,7.6999999999999999E-2,1479,37,1442,0.9749830966869506,703,902,0.4753211629479378,0.6098715348208249,0.46178547096975064,0.5133155359455297,0.60023666993052949,0.65013653831026252,1248,74.88,0.06,4.7E-2,7.2999999999999995E-2,"Sig better than Eng.",1357,1357.069,6.9000000000000006E-2,5.6000000000000008E-2,8.2000000000000003E-2,"Sig better than Eng.",1386,73.457999999999998,5.2999999999999999E-2,4.0999999999999995E-2,6.5000000000000002E-2,"Sig better than Eng.",1334,92.046000000000006,6.9000000000000006E-2,5.5000000000000007E-2,8.3000000000000004E-2,"Sig better than Eng.",1270,180.33999999999997,0.14199999999999999,0.12299999999999998,0.16099999999999998,"Sig better than Eng.",1176,145.82400000000001,0.124,0.105,0.14299999999999999,"Sig better than Eng.",1223,160.21299999999999,0.13100000000000001,0.112,0.15,"Sig better than Eng.",1192,135.88800000000001,0.114,9.6000000000000002E-2,0.13200000000000001,"Sig better than Eng.",1637,947,0.57849725106902872,0.55442004800520173,0.60220690618250572,1637,34,327,25.431192660550472,0.25202374527792726,1614,1025,0.63506815365551428,0.61128697123654441,0.65820791506573717,1614,34,322,26.602484472049689,0.21757398611618561,22188,21777,411,362,49,0.88077858880778592,0.11922141119221411,null,null,null,null,null,null,null,null,null,null,null,null,null,null,null,null,"n/a","n/a","n/a","n/a","n/a","n/a","n/a","n/a","n/a","n/a","n/a","n/a","n/a","n/a","n/a","n/a","n/a","n/a","n/a","n/a","n/a","n/a","n/a",140,1.6794625719769675E-2,13214,12411,803,6.0768881489329497E-2]
["LA - Worthing",null,"n/a","n/a","Worthing",null,"n/a","n/a","n/a","Coastal West Sussex","n/a",99500,100100,100600,101500,102400,102800,103800,105000,105700,106100,5400,5400,5500,5700,6000,6000,6100,6400,6300,6200,0.84554767533490938,3.2308904649330179E-2,6.3829787234042548E-2,4.5705279747832936E-2,7.8802206461780922E-3,3.9401103230890461E-3,0.152876280535855,11895,0.63287095418242956,0.12761664564943254,0.23951240016813788,1256,1187,1268,1194,1119,77,68,47,48,42,"n/a","n/a","n/a","n/a","n/a",null,null,null,null,null,null,null,null,null,null,null,null,null,null,null,2818,999,0.35450674237047552,287,"n/a",2346,4.9868208485672985E-2,1110,1095,1080,970,2775,0.157,2635,0.14799999999999999,2915,0.161,2865,0.157,2740,0.152,2460,0.13300000000000001,1193,54,1139,0.95473595976529757,471,617,0.39480301760268233,0.51718357082984079,0.3852577509569724,0.4423649047111447,0.51267474607533392,0.57045138444004106,808,66.256,8.2000000000000003E-2,6.3E-2,0.10100000000000001,"No Sig diff",1027,1027.0840000000001,8.4000000000000005E-2,6.7000000000000004E-2,0.10100000000000001,"No Sig diff",991,74.325000000000003,7.4999999999999997E-2,5.8999999999999997E-2,9.0999999999999998E-2,"Sig better than Eng.",1178,104.842,8.8999999999999996E-2,7.2999999999999995E-2,0.105,"No Sig diff",890,132.60999999999999,0.14899999999999999,0.126,0.17199999999999999,"Sig better than Eng.",920,150.88,0.16400000000000001,0.14000000000000001,0.188,"Sig better than Eng.",884,130.83199999999999,0.14799999999999999,0.125,0.17099999999999999,"Sig better than Eng.",871,133.26300000000001,0.153,0.129,0.17699999999999999,"Sig better than Eng.",1297,705,0.54356206630686199,0.51636542013974696,0.57050142995468545,1297,34,259,24.980694980694977,0.265273677038383,1223,746,0.60997547015535569,0.58233564728209375,0.63692658751275677,1223,34,244,25.426229508196734,0.2521697203471549,15545,15138,407,335,72,0.82309582309582308,0.1769041769041769,null,null,null,null,null,null,null,null,null,null,null,null,null,null,null,null,"n/a","n/a","n/a","n/a","n/a","n/a","n/a","n/a","n/a","n/a","n/a","n/a","n/a","n/a","n/a","n/a","n/a","n/a","n/a","n/a","n/a","n/a","n/a",114,1.7986746607762703E-2,9693,8518,1175,0.12122150005158362]
["CCG - Coastal West Sussex",null,"n/a","n/a","n/a",null,"n/a","n/a","n/a","Coastal West Sussex","n/a",460050,462250,465500,468900,472100,474150,477450,480050,483500,487050,22500,22550,22850,23450,24000,24500,25050,25500,26150,26300,0.88260783927516251,4.1559976363994486E-2,4.0575142800866652E-2,2.6196572779200317E-2,5.5150679535158559E-3,3.7423675398857593E-3,0.1173921607248375,49115,0.61329532729308767,0.15492212155146085,0.23178255115545149,"n/a","n/a","n/a","n/a","n/a","n/a","n/a","n/a","n/a","n/a",309,6.7100977198697065E-2,6.0229519571288234E-2,7.469407551801005E-2,"n/a",null,null,null,null,null,null,null,null,null,null,null,null,null,null,null,11170,3826,0.34252461951656221,1065,"n/a",8575,4.0440101489327585E-2,4350,4315,4420,4155,11415,0.14360585879634916,11590,0.13800628423473185,12195,0.14769797347046273,11375,0.1396245559285412,11845,0.13588628557226645,10605,0.13300000000000001,null,null,null,null,null,null,null,null,null,null,null,null,null,0,null,-1.7000000000000001E-2,1.7000000000000001E-2,{"$f":"IF(DG67>$DH$77,\"Sig worse than Eng.\",(IF(DH67<$DG$77,\"Sig better than Eng.\",\"No Sig diff\")))","v":"Sig better than Eng."},null,0,null,null,null,{"$f":"IF(DM67>$DN$77,\"Sig worse than Eng.\",(IF(DN67<$DM$77,\"Sig better than Eng.\",\"No Sig diff\")))","v":"Sig better than Eng."},null,0,null,-2.5999999999999999E-2,2.5999999999999999E-2,"Sig better than Eng.",null,0,null,-2.1999999999999999E-2,2.1999999999999999E-2,{"$f":"IF(DY67>$DZ$77,\"Sig worse than Eng.\",(IF(DZ67<$DY$77,\"Sig better than Eng.\",\"No Sig diff\")))","v":"Sig better than Eng."},null,0,null,-3.2000000000000001E-2,3.2000000000000001E-2,{"$f":"IF(EE67>$EF$77,\"Sig worse than Eng.\",(IF(EF67<$EE$77,\"Sig better than Eng.\",\"No Sig diff\")))","v":"Sig better than Eng."},null,0,null,-3.2000000000000001E-2,3.2000000000000001E-2,"Sig better than Eng.",0,{"$error":"#DIV/0!"},{"$error":"#DIV/0!"},{"$error":"#DIV/0!"},{"$error":"#DIV/0!"},{"$error":"#DIV/0!"},3697,541,0.14633486610765487,0.11333486610765486,0.17933486610765487,"Sig better than Eng.",5155,2669,0.51774975751697383,0.50410112467583079,0.53137195614294552,5155,34,1031,23.428709990300685,0.31092029440292102,5159,2997,0.58092653615041678,0.56740729295358927,0.59432535110686424,5159,34,1031,24.20368574199804,0.28812688994123414,null,null,null,null,null,null,null,null,null,null,null,null,null,null,null,null,null,null,null,null,null,null,null,"n/a","n/a","n/a","n/a","n/a","n/a","n/a","n/a","n/a","n/a","n/a","n/a","n/a","n/a","n/a","n/a","n/a","n/a","n/a","n/a","n/a","n/a","n/a",470,1.8530200283866899E-2,39541,35196,4345,0.10988594117498293]
["CCG - Crawley",null,"n/a","n/a","n/a",null,"n/a","n/a","n/a","Crawley","n/a",98900,99700,100750,101600,102850,103850,105500,107050,108300,108950,6300,6300,6350,6600,6950,7200,7750,8150,8300,8350,0.62205700123915741,6.5675340768277565E-2,7.6827757125154897E-2,0.17348203221809169,4.8946716232961589E-2,1.3011152416356878E-2,0.37794299876084264,14546,0.49099408772171044,0.31527567716210642,0.19373023511618315,"n/a","n/a","n/a","n/a","n/a","n/a","n/a","n/a","n/a","n/a",128,7.8963602714373846E-2,6.6808520694543738E-2,9.3109517714746015E-2,"n/a",null,null,null,null,null,null,null,null,null,null,null,null,null,null,null,3293,1363,0.4139082903127847,248,"n/a",2084,4.8774779413485618E-2,1650,1650,1580,1475,3775,0.19,3775,0.187,4090,0.19500000000000001,4165,0.19500000000000001,4165,0.19,3895,0.17399999999999999,null,null,null,null,null,null,null,null,null,null,null,null,null,0,null,-1.7000000000000001E-2,1.7000000000000001E-2,"Sig better than Eng.",null,0,null,null,null,"Sig better than Eng.",null,0,null,-2.5999999999999999E-2,2.5999999999999999E-2,{"$f":"IF(DS68>$DT$77,\"Sig worse than Eng.\",(IF(DT68<$DS$77,\"Sig better than Eng.\",\"No Sig diff\")))","v":"Sig better than Eng."},null,0,null,-2.1999999999999999E-2,2.1999999999999999E-2,"Sig better than Eng.",null,0,null,-3.2000000000000001E-2,3.2000000000000001E-2,"Sig better than Eng.",null,0,null,-3.2000000000000001E-2,3.2000000000000001E-2,{"$f":"IF(EK68>$EL$77,\"Sig worse than Eng.\",(IF(EL68<$EK$77,\"Sig better than Eng.\",\"No Sig diff\")))","v":"Sig better than Eng."},0,{"$error":"#DIV/0!"},{"$error":"#DIV/0!"},{"$error":"#DIV/0!"},{"$error":"#DIV/0!"},{"$f":"IF(EQ68>$ER$77,\"Sig worse than Eng.\",(IF(ER68<$EQ$77,\"Sig better than Eng.\",\"No Sig diff\")))","v":{"$error":"#DIV/0!"}},1075,210,0.19534883720930232,0.16234883720930232,0.22834883720930232,{"$f":"IF(EW68>$EX$77,\"Sig worse than Eng.\",(IF(EX68<$EW$77,\"Sig better than Eng.\",\"No Sig diff\")))","v":"No Sig diff"},1440,693,0.48125000000000001,0.45552756226071045,0.50707220957012045,1440,34,288,22.378472222222197,0.34180964052287655,1518,841,0.5540184453227931,0.52890795807318758,0.57885622396393932,1518,34,303,22.61056105610562,0.33498349834983471,null,null,null,null,null,null,null,null,null,null,null,null,null,null,null,null,null,null,null,null,null,null,null,"n/a","n/a","n/a","n/a","n/a","n/a","n/a","n/a","n/a","n/a","n/a","n/a","n/a","n/a","n/a","n/a","n/a","n/a","n/a","n/a","n/a","n/a","n/a",158,1.9602977667493797E-2,12900,11233,1667,0.12922480620155039]
["CCG - Horsham and Mid Sussex",null,"n/a","n/a","n/a",null,"n/a","n/a","n/a","Horsham and Mid Sussex","n/a",207050,208850,211150,213800,216050,218050,220250,221850,223350,225300,12000,11900,12100,12550,12700,12750,12900,13050,13200,13200,0.87605525709900234,3.760552570990023E-2,4.2210283960092097E-2,3.7221795855717575E-2,5.3722179585571758E-3,1.5349194167306216E-3,0.1239447429009977,25861,0.71114806078651249,0.12714125517188044,0.16171068404160704,"n/a","n/a","n/a","n/a","n/a","n/a","n/a","n/a","n/a","n/a",123,5.3829321663019694E-2,4.5302287629886681E-2,6.3854009700301834E-2,"n/a",null,null,null,null,null,null,null,null,null,null,null,null,null,null,null,4174,1090,0.26114039290848107,382,"n/a",2313,2.5460949969728659E-2,1205,1240,1270,1151,3485,8.3856315349003868E-2,3545,7.7140536236946833E-2,3655,8.6298797649483214E-2,3290,8.3734355128317436E-2,3450,8.1674341600085673E-2,3180,7.8E-2,null,null,null,null,null,null,null,null,null,null,null,null,null,0,null,-1.7000000000000001E-2,1.7000000000000001E-2,"Sig better than Eng.",null,0,null,null,null,"Sig better than Eng.",null,0,null,-2.5999999999999999E-2,2.5999999999999999E-2,"Sig better than Eng.",null,0,null,-2.1999999999999999E-2,2.1999999999999999E-2,"Sig better than Eng.",null,0,null,-3.2000000000000001E-2,3.2000000000000001E-2,"Sig better than Eng.",null,0,null,-3.2000000000000001E-2,3.2000000000000001E-2,"Sig better than Eng.",0,{"$error":"#DIV/0!"},{"$error":"#DIV/0!"},{"$error":"#DIV/0!"},{"$error":"#DIV/0!"},{"$error":"#DIV/0!"},1894,228,0.12038014783526928,8.7380147835269276E-2,0.15338014783526926,"Sig better than Eng.",2517,1446,0.57449344457687723,0.55507898366826613,0.59368086740758585,2517,34,503,25.262425447316105,0.25698748684364398,2577,1627,0.63135428793170356,0.61254508033958732,0.64977246639935593,2577,34,515,26.021359223300998,0.23466590519702948,null,null,null,null,null,null,null,null,null,null,null,null,null,null,null,null,null,null,null,null,null,null,null,"n/a","n/a","n/a","n/a","n/a","n/a","n/a","n/a","n/a","n/a","n/a","n/a","n/a","n/a","n/a","n/a","n/a","n/a","n/a","n/a","n/a","n/a","n/a",225,1.7293059718699561E-2,20507,19210,1297,6.3246696250060949E-2]
["Education Partnership Area - A",null,"n/a","n/a","n/a",null,"n/a","n/a","Education Partnership Area - A","Coastal West Sussex","n/a",182350,183400,184450,185750,187300,188050,189050,189700,191200,192950,8300,8350,8450,8700,8950,9250,9350,9450,9800,9950,0.88604898828541001,5.4845580404685838E-2,2.8221512247071354E-2,2.2364217252396165E-2,6.3897763578274758E-3,3.1948881789137379E-3,0.11395101171458999,18292,0.58233107369341786,0.16909031270500766,0.24857861360157446,"n/a","n/a","n/a","n/a","n/a","n/a","n/a","n/a","n/a",98,119,6.97538100820633E-2,5.8607749256263934E-2,8.2833118008409951E-2,"n/a",null,null,null,null,null,null,null,null,null,null,null,null,null,null,null,4045,1341,0.3315203955500618,359,"n/a",3092,3.7113055585562875E-2,1485,1480,1620,1535,"n/a","n/a","n/a","n/a","n/a","n/a","n/a","n/a",4165,0.13771466314398942,3895,0.12849893599607137,null,null,null,null,null,null,null,null,null,null,null,null,null,0,null,-1.7000000000000001E-2,1.7000000000000001E-2,"Sig better than Eng.",null,0,null,null,null,"Sig better than Eng.",null,0,null,-2.5999999999999999E-2,2.5999999999999999E-2,"Sig better than Eng.",1764,166,9.4104308390022678E-2,7.2104308390022687E-2,0.11610430839002267,"No Sig diff",null,0,null,-3.2000000000000001E-2,3.2000000000000001E-2,"Sig better than Eng.",null,0,null,-3.2000000000000001E-2,3.2000000000000001E-2,"Sig better than Eng.",null,0,null,-3.3000000000000002E-2,3.3000000000000002E-2,"Sig better than Eng.",1346,195.00000000000003,0.1448736998514116,0.1118736998514116,0.1778736998514116,"Sig better than Eng.",1955,929,0.4751918158567775,0.45312560281556069,0.49735533092044565,1955,33,391,22.069053708439903,0.33124079671394235,1961,1078,0.5497195308516063,0.52762343707184223,0.57162121145926115,1961,34,392,22.890306122448965,0.32675570228091277,null,null,null,null,null,null,null,null,null,null,null,null,null,null,null,null,null,null,null,null,null,null,null,"n/a","n/a","n/a","n/a","n/a","n/a","n/a","n/a","n/a","n/a","n/a","n/a","n/a","n/a","n/a","n/a","n/a","n/a","n/a","n/a","n/a","n/a","n/a",175,1.8660695244188525E-2,14691,13198,1493,0.10162684636852495]
["Education Partnership Area - B",null,"n/a","n/a","n/a",null,"n/a","n/a","Education Partnership Area - B","Coastal/Horsham and Mid Sussex","n/a",263500,264550,266350,268100,269550,270700,272600,274300,276200,277800,13350,13350,13550,13900,14150,14400,14750,15100,15400,15350,0.87869724160850782,3.4230641409106012E-2,4.7856430707876374E-2,2.991026919242273E-2,4.9850448654037887E-3,4.3203722166832836E-3,0.1213027583914922,28968,0.62810687655343833,0.14260563380281691,0.22928748964374482,"n/a","n/a","n/a","n/a","n/a","n/a","n/a","n/a","n/a",110,174,6.3457330415754923E-2,5.4929303532980554E-2,7.3206812152229392E-2,"n/a",null,null,null,null,null,null,null,null,null,null,null,null,null,null,null,6808,2392,0.35135135135135137,672,"n/a",5313,4.3575611436445054E-2,2725,2710,2705,2505,"n/a","n/a","n/a","n/a","n/a","n/a","n/a","n/a",7045,0.15298588490770901,6475,0.13938219782585298,null,null,null,null,null,null,null,null,null,null,null,null,null,0,null,-1.7000000000000001E-2,1.7000000000000001E-2,"Sig better than Eng.",null,0,null,null,null,"Sig better than Eng.",null,0,null,-2.5999999999999999E-2,2.5999999999999999E-2,"Sig better than Eng.",2713,234,8.6251382233689639E-2,6.4251382233689647E-2,0.10825138223368963,"No Sig diff",null,0,null,-3.2000000000000001E-2,3.2000000000000001E-2,"Sig better than Eng.",null,0,null,-3.2000000000000001E-2,3.2000000000000001E-2,"Sig better than Eng.",null,0,null,-3.3000000000000002E-2,3.3000000000000002E-2,"Sig better than Eng.",2211,325,0.14699231117141565,0.11399231117141564,0.17999231117141565,"Sig better than Eng.",3032,1623,0.53529023746701843,0.51750387204929615,0.55298729255952062,3032,34,606,24.288778877887793,0.28562415065035901,2971,1768,0.5950858296869741,0.57732306780997178,0.61260301995672917,2971,34,594,25.101010101010115,0.26173499702911429,null,null,null,null,null,null,null,null,null,null,null,null,null,null,null,null,null,null,null,null,null,null,null,"n/a","n/a","n/a","n/a","n/a","n/a","n/a","n/a","n/a","n/a","n/a","n/a","n/a","n/a","n/a","n/a","n/a","n/a","n/a","n/a","n/a","n/a","n/a",289,1.9224373045965543E-2,23383,20621,2762,0.11812000171064449]
["Education Partnership Area - C1",null,"n/a","n/a","n/a",null,"n/a","n/a","Education Partnership Area - C1","Crawley","n/a",98900,99700,100750,101600,102850,103850,105500,107050,108300,108950,6300,6300,6350,6600,6950,7200,7750,8150,8300,8350,0.62205700123915741,6.5675340768277565E-2,7.6827757125154897E-2,0.17348203221809169,4.8946716232961589E-2,1.3011152416356878E-2,0.37794299876084264,14546,0.49099408772171044,0.31527567716210642,0.19373023511618315,"n/a","n/a","n/a","n/a","n/a","n/a","n/a","n/a","n/a",64,128,7.8963602714373846E-2,6.6808520694543738E-2,9.3109517714746015E-2,"n/a",null,null,null,null,null,null,null,null,null,null,null,null,null,null,null,3293,1363,0.4139082903127847,248,"n/a",2084,4.8774779413485618E-2,1650,1650,1580,1475,"n/a","n/a","n/a","n/a","n/a","n/a","n/a","n/a",4170,0.19002050580997951,3890,0.17397137745974955,null,null,null,null,null,null,null,null,null,null,null,null,null,0,null,-1.7000000000000001E-2,1.7000000000000001E-2,"Sig better than Eng.",null,0,null,null,null,"Sig better than Eng.",null,0,null,-2.5999999999999999E-2,2.5999999999999999E-2,"Sig better than Eng.",1189,111.00000000000001,9.3355761143818342E-2,7.1355761143818336E-2,0.11535576114381835,"No Sig diff",null,0,null,-3.2000000000000001E-2,3.2000000000000001E-2,"Sig better than Eng.",null,0,null,-3.2000000000000001E-2,3.2000000000000001E-2,"Sig better than Eng.",null,0,null,-3.3000000000000002E-2,3.3000000000000002E-2,"Sig better than Eng.",1075,210,0.19534883720930232,0.16234883720930232,0.22834883720930232,"No Sig diff",1440,693,0.48125000000000001,0.45552756226071045,0.50707220957012045,1440,34,288,22.378472222222197,0.34180964052287655,1518,841,0.5540184453227931,0.52890795807318758,0.57885622396393932,1518,34,303,22.61056105610562,0.33498349834983471,null,null,null,null,null,null,null,null,null,null,null,null,null,null,null,null,null,null,null,null,null,null,null,"n/a","n/a","n/a","n/a","n/a","n/a","n/a","n/a","n/a","n/a","n/a","n/a","n/a","n/a","n/a","n/a","n/a","n/a","n/a","n/a","n/a","n/a","n/a",158,1.9602977667493797E-2,12900,11233,1667,0.12922480620155039]
["Education Partnership Area - C2",null,"n/a","n/a","n/a",null,"n/a","n/a","Education Partnership Area - C2","Horsham and Mid Sussex","n/a",129450,130500,132050,134000,135750,137200,138900,140200,141150,142750,7400,7450,7650,8000,8150,8150,8250,8350,8500,8550,0.87477531455961655,3.8945476333133611E-2,4.0143798681845415E-2,3.9544637507489516E-2,5.3924505692031152E-3,5.9916117435590175E-4,0.12522468544038345,16498,0.71044975148502854,0.12456055279427809,0.16498969572069341,"n/a","n/a","n/a","n/a","n/a","n/a","n/a","n/a","n/a",36,74,4.9798115746971738E-2,3.9852422821900144E-2,6.2065440935822419E-2,"n/a",null,null,null,null,null,null,null,null,null,null,null,null,null,null,null,2645,656,0.24801512287334593,222,"n/a",1360,2.3689665383476458E-2,740,770,785,691,"n/a","n/a","n/a","n/a","n/a","n/a","n/a","n/a",2105,8.2955665024630545E-2,1930,7.5805184603299297E-2,null,null,null,null,null,null,null,null,null,null,null,null,null,0,null,-1.7000000000000001E-2,1.7000000000000001E-2,"Sig better than Eng.",null,0,null,null,null,"Sig better than Eng.",null,0,null,-2.5999999999999999E-2,2.5999999999999999E-2,"Sig better than Eng.",1303,90,6.9071373752877974E-2,4.7071373752877975E-2,9.1071373752877965E-2,"Sig better than Eng.",null,0,null,-3.2000000000000001E-2,3.2000000000000001E-2,"Sig better than Eng.",null,0,null,-3.2000000000000001E-2,3.2000000000000001E-2,"Sig better than Eng.",null,0,null,-3.3000000000000002E-2,3.3000000000000002E-2,"Sig better than Eng.",1154,133,0.11525129982668977,8.2251299826689772E-2,0.14825129982668978,"Sig better than Eng.",1637,947,0.57849725106902872,0.55442004800520173,0.60220690618250572,1637,34,327,25.431192660550472,0.25202374527792726,1614,1025,0.63506815365551428,0.61128697123654441,0.65820791506573717,1614,34,322,26.602484472049689,0.21757398611618561,null,null,null,null,null,null,null,null,null,null,null,null,null,null,null,null,null,null,null,null,null,null,null,"n/a","n/a","n/a","n/a","n/a","n/a","n/a","n/a","n/a","n/a","n/a","n/a","n/a","n/a","n/a","n/a","n/a","n/a","n/a","n/a","n/a","n/a","n/a",140,1.6794625719769675E-2,13214,12411,803,6.0768881489329497E-2]
["Education Partnership Area - C3",null,"n/a","n/a","n/a",null,"n/a","n/a","Education Partnership Area - C3","Coastal/Horsham and Mid Sussex","n/a",91850,92650,93800,94800,95550,96250,97100,97700,98250,98900,5450,5300,5250,5450,5450,5500,5550,5650,5650,5650,0.88475177304964536,3.3687943262411348E-2,4.6099290780141841E-2,2.8368794326241134E-2,4.4326241134751776E-3,1.7730496453900709E-3,0.11524822695035461,11218,0.70823676234622923,0.14423248350864681,0.1475307541451239,"n/a","n/a","n/a","n/a","n/a","n/a","n/a","n/a","n/a",14,65,6.7991631799163177E-2,5.3701786657227038E-2,8.5739427921207589E-2,"n/a",null,null,null,null,null,null,null,null,null,null,null,null,null,null,null,1846,527,0.28548212351029251,194,"n/a",1123,2.7908248216903998E-2,605,595,580,575,"n/a","n/a","n/a","n/a","n/a","n/a","n/a","n/a",1575,8.7792642140468224E-2,1455,8.1284916201117316E-2,null,null,null,null,null,null,null,null,null,null,null,null,null,0,null,-1.7000000000000001E-2,1.7000000000000001E-2,"Sig better than Eng.",null,0,null,null,null,"Sig better than Eng.",null,0,null,-2.5999999999999999E-2,2.5999999999999999E-2,"Sig better than Eng.",872,65,7.4541284403669722E-2,5.2541284403669723E-2,9.6541284403669714E-2,"No Sig diff",null,0,null,-3.2000000000000001E-2,3.2000000000000001E-2,"Sig better than Eng.",null,0,null,-3.2000000000000001E-2,3.2000000000000001E-2,"Sig better than Eng.",null,0,null,-3.3000000000000002E-2,3.3000000000000002E-2,"Sig better than Eng.",880,115.99999999999999,0.13181818181818181,9.8818181818181805E-2,0.16481818181818181,"Sig better than Eng.",1048,616,0.58778625954198471,0.55771687583754714,0.61721443007075727,1048,34,209,25.28708133971292,0.25626231353785528,1190,753,0.63277310924369745,0.60499829450020992,0.6596934680996186,1190,34,238,25.205882352941188,0.2586505190311415,null,null,null,null,null,null,null,null,null,null,null,null,null,null,null,null,null,null,null,null,null,null,null,"n/a","n/a","n/a","n/a","n/a","n/a","n/a","n/a","n/a","n/a","n/a","n/a","n/a","n/a","n/a","n/a","n/a","n/a","n/a","n/a","n/a","n/a","n/a",91,1.6169154228855721E-2,8760,8176,584,6.6666666666666666E-2]
["West Sussex",null,"n/a","n/a","n/a",null,"n/a","n/a","n/a","n/a","n/a",766000,770800,777400,784300,791000,796000,803200,808900,815100,821400,40800,40700,41300,42600,43700,44500,45700,46700,47600,47800,0.8356459072819189,4.442293212864365E-2,4.7434656340755083E-2,5.4856405292029689E-2,1.2907389480477573E-2,4.7327094761751105E-3,0.16252554587501344,89522,0.62169075757914261,0.17295190009159758,0.20535734232925984,8927,9024,9198,9207,8835,{"$f":"SUM(AV60:AV66)","v":456},{"$f":"SUM(AW60:AW66)","v":399},367,345,331,null,null,null,null,714,14471,14675,7032,null,92663,163825,93098,55058,53,12250,18695,7042,5340,5030,4265,18637,6279,0.33691044696034772,1695,"n/a",12980,3.7999999999999999E-2,7205,7205,8688,{"$f":"SUM(CE60:CE66)","v":6781},19140,0.13900000000000001,18490,0.13400000000000001,19950,0.14299999999999999,19345,0.13800000000000001,19070,0.13500000000000001,17645,0.124,8655,345,8310,0.94599999999999995,3498,4605,0.42299999999999999,0.55200000000000005,null,null,null,null,6935,540.92999999999995,7.8E-2,7.1999999999999995E-2,8.4000000000000005E-2,"Sig better than Eng.",7601,7601.08,0.08,7.3999999999999996E-2,8.6000000000000007E-2,"Sig better than Eng.",6858,541.78200000000004,7.9000000000000001E-2,7.2999999999999995E-2,8.5000000000000006E-2,"Sig better than Eng.",7939,674.81500000000005,8.5000000000000006E-2,7.9000000000000001E-2,9.1000000000000011E-2,"Sig better than Eng.",7034,1104.338,0.157,0.14799999999999999,0.16600000000000001,"Sig better than Eng.",7004,1113.636,0.159,0.15,0.16800000000000001,"Sig better than Eng.",6928,1080.768,0.156,0.14699999999999999,0.16500000000000001,"Sig better than Eng.",6804,1000.188,0.14699999999999999,0.13899999999999998,0.155,"Sig better than Eng.",null,null,0.52,null,null,null,34,null,23.7,0.30399999999999999,null,null,0.59,null,null,null,34,null,24.5,0.27900000000000003,117072,113395,3677,3091,586,{"$f":"FW75/FV75","v":0.84063094914332337},{"$f":"FX75/FV75","v":0.15936905085667663},0.88888888888888884,0.1111111111111111,0.10265589099194035,0.12016948154318471,0.9129116993331986,8.7088300666801371E-2,7.9549266554230474E-2,9.5267872762318642E-2,0.89232948795790323,0.10767051204209674,9.9330388823194393E-2,0.11662022929165079,0.775904104022755,0.22409589597724502,0.21266415369596228,0.23595798632575507,"n/a","n/a","n/a","n/a","n/a","n/a","n/a","n/a","n/a","n/a","n/a","n/a","n/a","n/a","n/a","n/a","n/a","n/a","n/a","n/a","n/a","n/a","n/a",853,1.8369764186497255E-2,72948,65639,7309,0.10019465920929978]
["South East",null,"n/a","n/a","n/a",null,"n/a","n/a","n/a","n/a","n/a",8133100,8202900,8270900,8351400,8426400,8490900,8577800,8652800,8724700,8792600,460400,463200,471000,485900,500100,510600,525200,536000,545700,547500,0.78797720104448421,4.9481969545237585E-2,5.8579089726431249E-2,7.2617855438149873E-2,2.3922056772768537E-2,7.4218274729285797E-3,0.20955197619025334,1020973,0.60131071046932683,0.17231993402372051,0.22636935550695267,103669,106434,107132,107858,102190,5317,4994,4521,4191,3686,null,null,null,null,"n/a",167421,162401,85422,null,1041021,1860927,1044637,607685,566,138651,216366,81369,null,null,null,215348,78504,0.364544829763917,22090,"n/a",143980,0.04,87780,87380,88800,84810,238745,0.156,233325,0.152,249690,0.16,243950,0.155,239725,0.151,226290,0.14199999999999999,null,null,null,null,null,null,null,0.48899999999999999,null,null,null,null,82264,7156.9679999999998,8.6999999999999994E-2,8.4999999999999992E-2,8.8999999999999996E-2,"Sig better than Eng.",83380,83380.081999999995,8.2000000000000003E-2,0.08,8.4000000000000005E-2,"Sig better than Eng.",87844,7291.0520000000006,8.3000000000000004E-2,8.1000000000000003E-2,8.5000000000000006E-2,"Sig better than Eng.",89710,7087.09,7.9000000000000001E-2,7.6999999999999999E-2,8.1000000000000003E-2,"Sig better than Eng.",78560,13040.960000000001,0.16600000000000001,0.16300000000000001,0.16900000000000001,"Sig better than Eng.",76553,12707.798000000001,0.16600000000000001,0.16300000000000001,0.16900000000000001,"Sig better than Eng.",76433,12611.445,0.16500000000000001,0.16200000000000001,0.16800000000000001,"Sig better than Eng.",76191,12190.56,0.16,0.157,0.16300000000000001,"Sig better than Eng.",null,null,0.54,null,null,null,34,null,23.4,0.311,null,null,0.64,null,null,null,34,null,24.7,0.27500000000000002,1321193,1269063,52130,43594,8536,{"$f":"FW76/FV76","v":0.83625551505850759},{"$f":"FX76/FV76","v":0.16374448494149244},null,null,null,null,null,null,null,null,null,null,null,null,null,null,null,null,"n/a","n/a","n/a","n/a","n/a","n/a","n/a","n/a","n/a","n/a","n/a","n/a","n/a","n/a","n/a","n/a","n/a","n/a","n/a","n/a","n/a","n/a","n/a",10296,1.9291520050364809E-2,838584,748605,89979,0.10729873214847886]
["England",null,"n/a","n/a","n/a",null,"n/a","n/a","n/a","n/a","n/a",50194600,50606000,50965200,51381100,51815900,52196400,52642500,53107200,53493700,53865800,2876000,2908000,2963100,3049000,3142700,3211900,3280500,3328700,3393300,3414100,0.70716448944537358,5.2382889602073254E-2,6.4863113803130978E-2,0.10811824797721828,5.2839428046226398E-2,1.463032439843903E-2,0.29015956244632285,6286051,0.55249679011512953,0.21446978397089048,0.23303342591398002,671058,687006,688120,694241,664517,40359,37844,34025,31566,27213,null,null,null,null,"n/a",1064130,957255,566275,null,6408564,11437443,6423941,3373005,2885,890780,1573255,584016,null,null,null,1564681,634019,0.40520655648020265,151744,"n/a",1249560,5.7000000000000002E-2,724870,721690,731670,700500,2141960,0.224,2068970,0.216,2131350,0.219,2066320,0.21099999999999999,2026465,0.20599999999999999,1910205,0.192,null,null,null,null,null,null,null,0.47099999999999997,null,null,null,null,526499,51596.902000000002,9.8000000000000004E-2,9.7000000000000003E-2,9.9000000000000005E-2,null,540228,540228.09400000004,9.4E-2,9.2999999999999999E-2,9.5000000000000001E-2,null,565662,53737.89,9.5000000000000001E-2,9.4E-2,9.6000000000000002E-2,null,586332,54528.875999999997,9.2999999999999999E-2,9.1999999999999998E-2,9.4E-2,null,499867,93475.129000000001,0.187,0.186,0.188,null,464334,88223.46,0.19,0.189,0.191,null,491118,94294.656000000003,0.192,0.191,0.193,null,487817,92197.413,0.189,0.188,0.19,null,null,null,0.52,null,null,null,34,null,21.6,0.36599999999999999,null,null,0.6,null,null,null,34,null,22.5,0.33900000000000002,8015990,7549840,466150,390060,76090,{"$f":"FW77/FV77","v":0.83676928027458974},{"$f":"FX77/FV77","v":0.16323071972541028},null,null,null,null,null,null,null,null,null,null,null,null,null,null,null,null,"n/a","n/a","n/a","n/a","n/a","n/a","n/a","n/a","n/a","n/a","n/a","n/a","n/a","n/a","n/a","n/a","n/a","n/a","n/a","n/a","n/a","n/a","n/a",70922,2.1388687416405674E-2,5223191,4482036,741155,0.14189697447403321]
["Check on Education Area",null,null,null,null,null,null,null,null,null,"Check on Education Area",{"$f":"SUM(L70:L74)","v":766050},{"$f":"SUM(M70:M74)","v":770800},777400,784250,791000,796050,803150,808950,815100,821350,40800,{"$f":"SUM(W70:W74)","v":40750},{"$f":"SUM(X70:X74)","v":41250},42650,43650,44500,45650,46700,{"$f":"SUM(AD70:AD74)","v":47650},{"$f":"SUM(AE70:AE74)","v":47850},null,null,null,null,null,null,null,89522,3.1201185517998242,0.89576465997285593,0.98411678822731985,0,0,0,0,0,0,0,0,0,322,560,0.32996449075832701,0.27389978296291539,0.39695431673241532,0,0,0,0,0,0,0,0,0,0,0,0,0,0,0,0,null,null,null,null,0,null,0.181061360035874,null,null,null,null,0,0,0,0,0,0,0,0,19060,0.65146936102677677,17645,0.59894261208609056,0,{"$f":"SUM(CS70:CS74)","v":0},0,0,0,0,0,0,0,0,0,0,0,0,0,-8.5000000000000006E-2,8.5000000000000006E-2,0,0,0,0,0,0,0,0,0,0,-0.13,0.13,0,7841,666,0.41732410992407831,0.30732410992407838,0.5273241099240783,0,0,0,0,-0.16,0.16,0,0,0,0,-0.16,0.16,0,0,0,0,-0.16500000000000001,0.16500000000000001,0,6666,979,0.73428432987700121,0.56928432987700117,0.89928432987700102,0]
["Check on CCG",null,null,null,null,null,null,null,null,null,"Check on CCG",{"$f":"SUM(L67:L69)","v":766000},{"$f":"SUM(M67:M69)","v":770800},777400,784300,791000,796050,803200,808950,815150,821300,40800,{"$f":"SUM(W67:W69)","v":40750},{"$f":"SUM(X67:X69)","v":41300},42600,43650,44450,45700,46700,{"$f":"SUM(AD67:AD69)","v":47650},{"$f":"SUM(AE67:AE69)","v":47850},null,null,null,null,null,null,null,89522,1.8154374758013105,0.59733905388544772,0.58722347031324174,0,0,0,0,0,0,0,0,0,0,560,0.1998939015760906,0.17234032789571868,0.2316576029330579,0,0,0,0,0,0,0,0,0,0,0,0,0,0,0,0,null,null,null,null,0,null,0.11467583087254186,null,null,null,null,18675,0.41746217414535303,18910,0.40214682047167871,19940,0.42899677111994594,18830,0.41835891105685868,19460,0.40756062717235214,17680,0.38500000000000001,0,{"$f":"SUM(CS67:CS69)","v":0},0,0,0,0,0,0,0,0,0,0,0,0,0,-5.1000000000000004E-2,5.1000000000000004E-2,0,0,0,0,0,0,0,0,0,0,-7.8E-2,7.8E-2,0,0,0,0,-6.6000000000000003E-2,6.6000000000000003E-2,0,0,0,0,-9.6000000000000002E-2,9.6000000000000002E-2,0,0,0,0,-9.6000000000000002E-2,9.6000000000000002E-2,0,0,{"$error":"#DIV/0!"},{"$error":"#DIV/0!"},{"$error":"#DIV/0!"},{"$error":"#DIV/0!"},{"$error":"#DIV/0!"},6666,979,0.46206385115222648,0.36306385115222645,0.56106385115222646,0]
["Check on Groups",null,null,null,null,null,null,null,null,null,"Check on Groups",{"$f":"SUM(L48:L59)","v":765990},{"$f":"SUM(M48:M59)","v":770795},777395,784280,790975,796045,803155,808925,815110,821355,40820,{"$f":"SUM(W48:W59)","v":40740},{"$f":"SUM(X48:X59)","v":41310},42595,43655,44435,45665,46670,{"$f":"SUM(AD48:AD59)","v":47675},{"$f":"SUM(AE48:AE59)","v":47845},null,null,null,null,null,null,null,89522,7.3752150340535279,2.037848359153791,2.5869366067926816,8666,8811,9030,8859,8511,443,396,375,338,322,560,0.79264810779003458,0.58388841837018735,1.07485047837794,666,14471,14675,7032,0.88299803688677247,92663,163825,93098,55058,53,12250,18695,7042,5340,5030,4265,null,null,null,null,0,null,0.47044650244402053,null,null,null,null,18635,1.7891130311711954,18540,1.7220669928460144,19860,1.8356233952607031,19150,1.7374962100433557,19400,1.6985294763407961,17620,1.5726712852629814,8655,{"$f":"SUM(CS48:CS59)","v":345},8310,11.450422127415679,3498,4605,5.0295117353450403,6.5126635455209918,4.5504049976292924,5.5229525048175789,6.0196758723234538,6.9996613595088046,6842,534,0.96385478992753137,0.71314945395141049,1.3023181836527025,0,7515,599,0.96566307358692827,0.72100176122405202,1.2905379398468917,0,6743,525,1.0221956077885301,0.75310430989856381,1.3789112710252087,0,7841,666,1.0330772696128614,0.78472684303770113,1.3553383622887947,0,6911,1099,1.9484190204075418,1.5811050946438596,2.3847662403843279,0,6888,1096,1.9916951662101992,1.6166977151174866,2.4365507936140385,0,6812,1062,1.909120219942102,1.5390431402536866,2.3529937826312972,0,6666,979,1.7727082185657885,1.4165037465172488,2.2050056689819995,0]
["Check on CFC",null,null,null,null,null,null,null,null,null,"Check on CFC",{"$f":"SUM(L3:L47)","v":765995},{"$f":"SUM(M3:M47)","v":770795},777395,784280,790985,796040,803155,808920,815120,821365,40830,{"$f":"SUM(W3:W47)","v":40735},{"$f":"SUM(X3:X47)","v":41335},42610,43655,44420,45670,46670,{"$f":"SUM(AD3:AD47)","v":47665},{"$f":"SUM(AE3:AE47)","v":47830},null,null,null,null,null,null,null,89530,28.134164230964139,7.7068862386044144,9.1589495304314461,8666,8811,9030,8859,8511,443,396,375,338,322,560,2.9628767555369611,1.7202862114559676,5.0995959018250181,666,14471,14675,7032,6.4961348632537081,92663,163825,93098,55058,53,12250,18695,7042,5340,5030,4265,null,null,null,null,250,null,{"$f":"SUM(#REF!)","v":{"$error":"#REF!"}},null,null,null,null,19070,6.014809201909201,19295,5.7502526251526271,19930,6.140482017982019,18445,5.8916338023088031,19155,5.7442621989121978,17675,5.5470579212818434,8655,{"$f":"SUM(CS3:CS47)","v":345},8310,42.567523579150333,3498,4605,19.053738941646948,24.849715905662734,15.833835522667687,22.394398998968626,21.568665561184531,28.150145608880077,6842,534,3.4803520529482093,2.0182271933542606,5.9434248917987009,0,7515,599,3.5953982587432565,2.1424072713636053,5.9522226015503286,0,6743,525,3.5541609487504364,2.0434373753127724,6.0975406938641665,0,7841,666,3.7498666884876637,2.2952067181090015,6.0706444685993945,0,6911,1099,7.2596899344736787,4.9908742484381703,10.322997987367758,0,6888,1096,7.1878500809769887,4.932921800224225,10.246582969254888,0,6812,1062,6.9450129772871527,4.7402861353317993,9.9837171430946992,0,6666,979,6.5866688783416878,4.4370692532704092,9.5943575420423315,0]
["Check  on LA",null,null,null,null,null,null,null,null,null,"Check  on LA",{"$f":"SUM(L60:L66)","v":766100},{"$f":"SUM(M60:M66)","v":770800},777400,784300,791000,796000,803200,808900,815200,821400,40900,{"$f":"SUM(W60:W66)","v":40800},{"$f":"SUM(X60:X66)","v":41400},42700,43700,44500,45500,46700,{"$f":"SUM(AD60:AD66)","v":47700},{"$f":"SUM(AE60:AE66)","v":47800},null,null,null,null,null,null,null,89522,4.3281895605000145,1.2176048640602244,1.4542055754397607,8927,9024,9198,9207,8835,456,399,367,345,331,0,0,0,0,0,0,0,0,0,0,0,0,0,0,0,0,0,0,0,0,null,null,null,null,0,null,0.27117741879635149,null,null,null,null,19140,1.0069999999999999,18485,0.97099999999999986,19950,1.0319999999999998,19345,0.99199999999999999,19025,0.97,17635,0.8899999999999999,8655,{"$f":"SUM(CS60:CS66)","v":345},8310,6.6946492905056978,3498,4605,2.8170369866595988,3.69422866793836,2.7448307297800594,3.1479914706809256,3.656083850010809,4.0620476456525108,6935,539.27,0.53800000000000003,0.41899999999999998,0.65700000000000003,0,7601,7601.570999999999,0.57099999999999995,0.45500000000000002,0.68699999999999994,0,6858,539.65,0.56900000000000006,0.44599999999999995,0.69199999999999995,0,7939,678.39200000000005,0.59899999999999998,0.48400000000000004,0.71399999999999986,0,7034,1106.2159999999999,1.1100000000000001,0.94900000000000007,1.2709999999999999,0,7004,1112.1129999999998,1.1199999999999999,0.95600000000000007,1.2839999999999998,0,6928,1078.3809999999999,1.099,0.93500000000000005,1.2629999999999999,0,6804,997.16,1.04,0.90869999999999995,1.2010000000000001,0]

{"sheet":"TeenPreg","index":2,"n_rows":10,"n_cols":25,"rows_kept":10,"cut":false,"hidden":true,"merged":[]}
["Area","Number 2005-2007","Rate 2005-2007","LCL 2005-2007","UCL 2005-2007","Number 2006-2008","Rate 2006-2008","LCL 2006-2008","UCL 2006-2008","Number 2007-2009","Rate 2007-2009","LCL 2007-2009","UCL 2007-2009","Number 2008-2010","Rate 2008-2010","LCL 2008-2010","UCL 2008-2010","Number 2009-2011","Rate 2009-2011","LCL 2009-11","UCL 2009-2011","Number 2010-2012","Rate 2010-2012","LCL 2010-12","UCL 2010-20121"]
["Adur",133,37.299999999999997,31.230511007813849,44.204716298407554,119,33.1,27.420605916369514,39.609084951901316,119,32.9,27.6,39.200000000000003,107,29.9,24.8,36,108,33.200000000000003,27.6,39.9,98,30.6,25.2,37.200000000000003]
["Arun",251,34.799999999999997,30.627613372297347,39.382164747024412,275,38.700000000000003,34.26075053061561,43.55479947960967,259,37,32.9,41.7,267,38.700000000000003,34.4,43.5,232,33.9,29.9,38.5,220,32.1,28.2,36.6]
["Chichester",157,27.5,23.366618428428829,32.153879885916062,161,27.9,23.756782714557747,32.558001513983783,164,28.8,24.8,33.5,147,26.3,22.5,30.9,131,24.8,21,29.4,132,25.4,21.4,30]
["Crawley",232,39.4,34.492808309712423,44.809544555229245,255,43.5,38.324273539643414,49.179832636804619,262,44.3,39.299999999999997,49.8,261,44.1,39.200000000000003,49.7,220,37.700000000000003,33.1,42.9,190,33.700000000000003,29.3,38.700000000000003]
["Horsham",157,19.3,16.399117660679146,22.566177519933817,160,20.100000000000001,17.106168410700313,23.467045059750248,155,19.100000000000001,16.3,22.3,154,18.8,16.100000000000001,22,127,16.600000000000001,14,19.7,108,14.3,11.9,17.2]
["Mid Sussex",164,22.4,19.102879133087416,26.102769438758152,163,22.2,18.922713979998338,25.881810262278151,179,24.2,20.9,28,171,23.3,20.100000000000001,27,141,18.3,15.5,21.5,117,15,12.6,18]
["Worthing",200,38.4,33.262249988601056,44.106620437706624,204,39.299999999999997,34.09177995918899,45.078879090776375,203,39.799999999999997,34.700000000000003,45.5,174,34.799999999999997,30.1,40.299999999999997,161,32.299999999999997,27.7,37.6,151,30.2,25.8,35.299999999999997]
["West Sussex",1284,30.196843912419745,28.567535104483948,31.894859642287095,1337,31.2,29.6,32.9,1341,31.3,29.7,33,1281,30.1,28.5,31.8,1120,27,25.4,28.6,1016,24.6,23.2,26.2]
["England",119272,41.2,40.966510345412779,41.434490411159572,118319,41,40.700000000000003,41.2,115115,40.200000000000003,39.9,40.4,107301,38.1,37.799999999999997,38.299999999999997,97684,34,33.799999999999997,34.200000000000003,87875,30.9,30.7,31.1]